none
about WLK1.5 USB Host Controller Compliance (Automated) fail item problem RRS feed

  • 问题

  • I have the  fail for USB test of WLK1.5
    The log file as below
    And I have updated the latest filter, it still fail

     

     

    Start Test 12/24/2009 4:49:15.054 PM <<< FAILED: BUSPORT-0041 - XHCI Spec Version >>>
    Error 12/24/2009 4:49:15.054 PM +VAR+SEV1 2 : <<< FAILED: BUSPORT-0041 - XHCI Spec Version >>>
    File:   d:\5429t\testsrc\driverstest\usb\inteldrop\hw32\usb\pc_2001\usbhcvct\versiontests.c Line: 454
    Error Type:    
    Error Code:   0x0
    Error Text:   Error 0x00000000
    End Test 12/24/2009 4:49:15.054 PM <<< FAILED: BUSPORT-0041 - XHCI Spec Version >>>
    Result:   Fail
    Repro:   C:\WTT\JobsWorkingDir\Tasks\WTTJobRun4E2A3D61-CC77-41BF-8B21-06ED965F7DB8\Usbhcvct.exe -l Usbhcvct.log
    Message 12/24/2009 4:49:15.054 PM +TEST+INFO :
     
    Message 12/24/2009 4:49:15.054 PM +TEST+INFO :
     
    Context _ _
    Context Index:   2969525450
    Current:   <<< FAILED: USB Test Assertion 9.1.B1 >>>
    Parent:   WTTLOG
    Start Test 12/24/2009 4:49:15.054 PM <<< FAILED: USB Test Assertion 9.1.B1 >>>
    Error 12/24/2009 4:49:15.054 PM +VAR+SEV1 3 : <<< FAILED: USB Test Assertion 9.1.B1 >>>
    File:   d:\5429t\testsrc\driverstest\usb\inteldrop\hw32\usb\pc_2001\usbhcvct\usbhcvct.c Line: 455
    Error Type:    
    Error Code:   0x0
    Error Text:   Error 0x00000000
    End Test 12/24/2009 4:49:15.054 PM <<< FAILED: USB Test Assertion 9.1.B1 >>>
    Result:   Fail
    Repro:   C:\WTT\JobsWorkingDir\Tasks\WTTJobRun4E2A3D61-CC77-41BF-8B21-06ED965F7DB8\Usbhcvct.exe -l Usbhcvct.log
    Context _ _
    Context Index:   1432353587
    Current:   <<< USB Host Controller Version Compliance Test : Test Failed >>>
    Parent:   WTTLOG
    Start Test 12/24/2009 4:49:15.054 PM <<< USB Host Controller Version Compliance Test : Test Failed >>>
    Error 12/24/2009 4:49:15.054 PM +TEST+SEV1 : <<< USB Host Controller Version Compliance Test : Test Failed >>>
    File:   d:\5429t\testsrc\driverstest\usb\inteldrop\hw32\usb\pc_2001\usbhcvct\usbhcvct.c Line: 457
    Error Type:    
    Error Code:   0x0
    Error Text:   Error 0x00000000
    End Test 12/24/2009 4:49:15.054 PM <<< USB Host Controller Version Compliance Test : Test Failed >>>
    Result:   Fail
    Repro:   C:\WTT\JobsWorkingDir\Tasks\WTTJobRun4E2A3D61-CC77-41BF-8B21-06ED965F7DB8\Usbhcvct.exe -l Usbhcvct.log

    • 已更改类型 duoduobearModerator 2011年4月18日 9:32 这是一个问题。并且已经有了答复。
    2010年11月26日 12:38

答案

  • 2010上半年的時候此項目可以使用DTM Filter可以濾過,但此Filter已經過期,故現在都是Fail,但大家如果要Submit,可以使用preview filter #3442進行Submit

     

    2011年3月18日 8:04

全部回复

  • I also encounter the same problem. And I confirm installed QFE001 with WLK1.5.the result is still failed.

    And I can repro this failed with WLK1.6

    the failed log aim to XHCI controller ,any one can help to explain this?


    宏河
    2011年3月8日 22:29
  • Need more information for inverstigation. could you use the following command to test manually and check the log file. You should find usbhcvct.exe in DTM controller.

    Usbhcvct.exe -l Usbhcvct.log


    http://www.microsoft.com/china/whdc http://ctcwhql.spaces.live.com/blog/
    2011年3月9日 4:50
    版主
  • I run the software ,encounter one error CMDtuil.DLL file miss The error infor: 3761187106 Current: <<< FAILED: BUSPORT-0041 - XHCI Spec Version >>> Parent: WTTLOG Start Test 3/9/2011 1:40:20.190 PM <<< FAILED: BUSPORT-0041 - XHCI Spec Version >>> Error 3/9/2011 1:40:20.190 PM +VAR+SEV1 2 : <<< FAILED: BUSPORT-0041 - XHCI Spec Version >>> File: d:\5429t\testsrc\driverstest\usb\inteldrop\hw32\usb\pc_2001\usbhcvct\versiontests.c Line: 454 Error Type: Error Code: 0x0 Error Text: Error 0x00000000 End Test 3/9/2011 1:40:20.190 PM <<< FAILED: BUSPORT-0041 - XHCI Spec Version >>> Result: Fail Repro: C:\WTT\JobsWorkingDir\Tasks\WTTJobRun9C42937D-30DE-40ED-BED1-3E1152D49050\Usbhcvct.exe -l Usbhcvct.log Message 3/9/2011 1:40:20.190 PM +TEST+INFO : Message 3/9/2011 1:40:20.190 PM +TEST+INFO : Context Context Index: 2969525450 Current: <<< FAILED: USB Test Assertion 9.1.B1 >>> Parent: WTTLOG Start Test 3/9/2011 1:40:20.190 PM <<< FAILED: USB Test Assertion 9.1.B1 >>> Error 3/9/2011 1:40:20.190 PM +VAR+SEV1 3 : <<< FAILED: USB Test Assertion 9.1.B1 >>> File: d:\5429t\testsrc\driverstest\usb\inteldrop\hw32\usb\pc_2001\usbhcvct\usbhcvct.c Line: 455 Error Type: Error Code: 0x0 Error Text: Error 0x00000000 End Test 3/9/2011 1:40:20.190 PM <<< FAILED: USB Test Assertion 9.1.B1 >>> Result: Fail Repro: C:\WTT\JobsWorkingDir\Tasks\WTTJobRun9C42937D-30DE-40ED-BED1-3E1152D49050\Usbhcvct.exe -l Usbhcvct.log Context Context Index: 1432353587 Current: <<< USB Host Controller Version Compliance Test : Test Failed >>> Parent: WTTLOG Start Test 3/9/2011 1:40:20.190 PM <<< USB Host Controller Version Compliance Test : Test Failed >>> Error 3/9/2011 1:40:20.190 PM +TEST+SEV1 : <<< USB Host Controller Version Compliance Test : Test Failed >>> File: d:\5429t\testsrc\driverstest\usb\inteldrop\hw32\usb\pc_2001\usbhcvct\usbhcvct.c Line: 457 Error Type: Error Code: 0x0 Error Text: Error 0x00000000 End Test 3/9/2011 1:40:20.190 PM <<< USB Host Controller Version Compliance Test : Test Failed >>> Result: Fail Repro: C:\WTT\JobsWorkingDir\Tasks\WTTJobRun9C42937D-30DE-40ED-BED1-3E1152D49050\Usbhcvct.exe -l Usbhcvct.log
    宏河
    2011年3月10日 1:22
  • Could you find Usbhcvct.log file?
    http://www.microsoft.com/china/whdc http://ctcwhql.spaces.live.com/blog/
    2011年3月10日 2:02
    版主
  • Dear duoduobear:

    No i can not find the log file.

    BTW, we find below information as below Dose it mean this issue can be covered by this Errata 1787. Althought the log file is failed , it still can be submit logo?
    Failure Information
    Issue Description Applied Nodes
    -[Filter Number:3442 Row:225 ] -
    This Preview Test or Test Case is being filtered until the expiration date of this Errata. After the expiration date of this filter these failures must be fixed to have a passing submission. Microsoft strongly recommends that these errors be investigated prior to this test or job being required for submission.
    Errata 1787
    XHCI spec compliance test is in preview
    For further details visit: https://winqual.microsoft.com/ec/

    Issue Resolution
    A separate resolution is not provided for this issue

    Failed item:

    Failed item:
    +VAR+SEV1 2 : <<< FAILED: BUSPORT-0041 - XHCI Spec Version >>>
    +VAR+SEV1 3 : <<< FAILED: USB Test Assertion 9.1.B1 >>> 
    +TEST+SEV1 : <<< USB Host Controller Version Compliance Test : Test Failed >>>


    宏河
    2011年3月10日 6:09
  • 2010上半年的時候此項目可以使用DTM Filter可以濾過,但此Filter已經過期,故現在都是Fail,但大家如果要Submit,可以使用preview filter #3442進行Submit

     

    2011年3月18日 8:04
  • Hi All,

    请问, preview filter #3442 去哪里down 呢? 我看到了#1787,,多谢!

    2011年4月18日 6:51