none
USB fail..紧急求助 RRS feed

  • 问题

  • 各位大虾:

    小弟最近在做huromriver平台的才WHQL,其中有一项一直FAIL,紧急求助:

    测试项目:

    USB host controller compliance(automated)

    LOG如下:

    384048256
    Current: WTTLOG
    Parent: ROOT
    Message 9/22/2011 5:17:47.846 上午 +TEST+INFO : =========================================================
    Message 9/22/2011 5:17:47.846 上午 +TEST+INFO : Test Name: USB Host Controller Version Compliance Test
    Message 9/22/2011 5:17:47.846 上午 +TEST+INFO : Full Path: C:\WLK\JobsWorkingDir\Tasks\WTTJobRun56D30A47-0409-4142-931C-321D8D03B35F\usbhcvct.exe
    Message 9/22/2011 5:17:47.846 上午 +TEST+INFO : Invocation: C:\WLK\JobsWorkingDir\Tasks\WTTJobRun56D30A47-0409-4142-931C-321D8D03B35F\usbhcvct.exe-l Usbhcvct.log
    Message 9/22/2011 5:17:47.846 上午 +TEST+INFO : Log File: Usbhcvct.log
    Message 9/22/2011 5:17:47.846 上午 +TEST+INFO : Version : 0.0.0.5
    Message 9/22/2011 5:17:47.846 上午 +TEST+INFO : =========================================================
    Message 9/22/2011 5:17:47.846 上午 +TEST+INFO :
    Message 9/22/2011 5:17:47.846 上午 +TEST+INFO :
    Message 9/22/2011 5:17:47.846 上午 +TEST+INFO : The following assertions are tested by this test
    Message 9/22/2011 5:17:47.846 上午 +TEST+INFO :
    Message 9/22/2011 5:17:47.846 上午 +TEST+INFO : <<< USB Test Assertion : 9.1.B1>>>
    Message 9/22/2011 5:17:47.846 上午 +TEST+INFO : USB host controllers must meet the OpenHCI Specification, or
    Message 9/22/2011 5:17:47.846 上午 +TEST+INFO : the UHCI Specification, or the EHCI Specification, or the XHCI Specification
    Message 9/22/2011 5:17:47.846 上午 +TEST+INFO :
    Message 9/22/2011 5:17:47.846 上午 +TEST+INFO : <<< USB Test Assertion : 9.1.B2>>>
    Message 9/22/2011 5:17:47.846 上午 +TEST+INFO : EHCI USB host controllers must meet version .95 of the EHCI specification.
    Message 9/22/2011 5:17:47.846 上午 +TEST+INFO :
    Message 9/22/2011 5:17:47.846 上午 +TEST+INFO : <<< USB Test Assertion : 9.1.B3>>>
    Message 9/22/2011 5:17:47.846 上午 +TEST+INFO : OHCI host controllers must meet version 1.0a of the OHCI Specification.
    Message 9/22/2011 5:17:47.846 上午 +TEST+INFO :
    Message 9/22/2011 5:17:47.846 上午 +TEST+INFO : <<< USB Test Assertion : 9.1.B4>>>
    Message 9/22/2011 5:17:47.846 上午 +TEST+INFO : UHCI host controllers must meet version 1.1 of the UHCI Specification.
    Message 9/22/2011 5:17:47.846 上午 +TEST+INFO :
    Message 9/22/2011 5:17:47.846 上午 +TEST+INFO : <<< BUSPORT - 0041 >>>
    Message 9/22/2011 5:17:47.846 上午 +TEST+INFO : USB 3.0 controllers are XHCI version 1.0 compliant.
    Message 9/22/2011 5:17:47.846 上午 +TEST+INFO :
    Message 9/22/2011 5:17:47.846 上午 +TEST+INFO : Test Initialization...
    Message 9/22/2011 5:17:47.846 上午 +TEST+INFO : Enumerate all PCI devices to locate USB controllers...
    Message 9/22/2011 5:17:47.846 上午 +TEST+INFO : EHCI controller
    Message 9/22/2011 5:17:47.846 上午 +TEST+INFO : The EHCI version is 100
    Context
    Context Index: 2856236793
    Current: <<< PASSED: USB Test Assertion 9.1.B2 - EHCI Spec Version >>>
    Parent: WTTLOG
    Start Test 9/22/2011 5:17:47.846 上午 <<< PASSED: USB Test Assertion 9.1.B2 - EHCI Spec Version >>>
    Message 9/22/2011 5:17:47.846 上午 +VAR+PASS 0 : <<< PASSED: USB Test Assertion 9.1.B2 - EHCI Spec Version >>>
    End Test 9/22/2011 5:17:47.846 上午 <<< PASSED: USB Test Assertion 9.1.B2 - EHCI Spec Version >>>
    Result: Pass
    Repro: C:\WLK\JobsWorkingDir\Tasks\WTTJobRun56D30A47-0409-4142-931C-321D8D03B35F\Usbhcvct.exe -l Usbhcvct.log
    Message 9/22/2011 5:17:47.846 上午 +TEST+INFO :
    Message 9/22/2011 5:17:47.846 上午 +TEST+INFO : EHCI controller
    Message 9/22/2011 5:17:47.846 上午 +TEST+INFO : The EHCI version is 100
    Start Test 9/22/2011 5:17:47.846 上午 <<< PASSED: USB Test Assertion 9.1.B2 - EHCI Spec Version >>>
    Message 9/22/2011 5:17:47.846 上午 +VAR+PASS 1 : <<< PASSED: USB Test Assertion 9.1.B2 - EHCI Spec Version >>>
    End Test 9/22/2011 5:17:47.846 上午 <<< PASSED: USB Test Assertion 9.1.B2 - EHCI Spec Version >>>
    Result: Pass
    Repro: C:\WLK\JobsWorkingDir\Tasks\WTTJobRun56D30A47-0409-4142-931C-321D8D03B35F\Usbhcvct.exe -l Usbhcvct.log
    Message 9/22/2011 5:17:47.846 上午 +TEST+INFO :
    Message 9/22/2011 5:17:47.846 上午 +TEST+INFO : XHCI controller
    Message 9/22/2011 5:17:47.846 上午 +TEST+INFO : The XHCI version is 96
    Context
    Context Index: 3761187106
    Current: <<< FAILED: BUSPORT-0041 - XHCI Spec Version >>>
    Parent: WTTLOG
    Start Test 9/22/2011 5:17:47.846 上午 <<< FAILED: BUSPORT-0041 - XHCI Spec Version >>>
    Error 9/22/2011 5:17:47.846 上午 +VAR+SEV1 2 : <<< FAILED: BUSPORT-0041 - XHCI Spec Version >>>
    File: d:\6229t\testsrc\driverstest\usb\inteldrop\hw32\usb\pc_2001\usbhcvct\versiontests.c Line: 454
    Error Type:
    Error Code: 0x0
    Error Text: Error 0x00000000
    End Test 9/22/2011 5:17:47.846 上午 <<< FAILED: BUSPORT-0041 - XHCI Spec Version >>>
    Result: Fail
    Repro: C:\WLK\JobsWorkingDir\Tasks\WTTJobRun56D30A47-0409-4142-931C-321D8D03B35F\Usbhcvct.exe -l Usbhcvct.log
    Message 9/22/2011 5:17:47.846 上午 +TEST+INFO :
    Message 9/22/2011 5:17:47.846 上午 +TEST+INFO :
    Context
    Context Index: 2969525450
    Current: <<< FAILED: USB Test Assertion 9.1.B1 >>>
    Parent: WTTLOG
    Start Test 9/22/2011 5:17:47.846 上午 <<< FAILED: USB Test Assertion 9.1.B1 >>>
    Error 9/22/2011 5:17:47.846 上午 +VAR+SEV1 3 : <<< FAILED: USB Test Assertion 9.1.B1 >>>
    File: d:\6229t\testsrc\driverstest\usb\inteldrop\hw32\usb\pc_2001\usbhcvct\usbhcvct.c Line: 455
    Error Type:
    Error Code: 0x0
    Error Text: Error 0x00000000
    End Test 9/22/2011 5:17:47.846 上午 <<< FAILED: USB Test Assertion 9.1.B1 >>>
    Result: Fail
    Repro: C:\WLK\JobsWorkingDir\Tasks\WTTJobRun56D30A47-0409-4142-931C-321D8D03B35F\Usbhcvct.exe -l Usbhcvct.log
    Context
    Context Index: 1432353587
    Current: <<< USB Host Controller Version Compliance Test : Test Failed >>>
    Parent: WTTLOG
    Start Test 9/22/2011 5:17:47.846 上午 <<< USB Host Controller Version Compliance Test : Test Failed >>>
    Error 9/22/2011 5:17:47.846 上午 +TEST+SEV1 : <<< USB Host Controller Version Compliance Test : Test Failed >>>
    File: d:\6229t\testsrc\driverstest\usb\inteldrop\hw32\usb\pc_2001\usbhcvct\usbhcvct.c Line: 457
    Error Type:
    Error Code: 0x0
    Error Text: Error 0x00000000
    End Test 9/22/2011 5:17:47.846 上午 <<< USB Host Controller Version Compliance Test : Test Failed >>>
    Result: Fail
    Repro: C:\WLK\JobsWorkingDir\Tasks\WTTJobRun56D30A47-0409-4142-931C-321D8D03B35F\Usbhcvct.exe -l Usbhcvct.log
    Pass/Fail Result Rollup Counts 9/22/2011 5:17:47.846 上午  
    Total:   5
    Passed:   2
    Failed:   3
    Blocked:   0
    Warned:   0
    Skipped:   0

     

    应该是USB3.0导致的FAIL。。跪求大侠帮忙、。

    2011年9月21日 6:57

答案

  • 这个错误是3.0的,好像微软那边知道这个错误的吧,也就是只要其他所有项都过了就默认过whql了,不用管它的,虽然不能过滤掉。问问你的老大看看啊。

    2011年9月22日 1:49