locked
Can't build the AjaxControlToolkit from souce in Visual Studio 2012 (21 errors) RRS feed

  • Question

  • User-1175241094 posted

    I recently downloaded the source for the ajaxcontroltoolkit from (http://ajaxcontroltoolkit.codeplex.com/SourceControl/latest#ReadMe.html).  I opened up the project (from AjaxControlTookit.sln) and made a few changes to the htmleditorextender.  The changes I made were to stop the removal of width, id, and class tags when encoding, but I do not think that the errors I am getting are related to this.

    When I attempt to "build solution" I get the following errors:

    Error	1	The type or namespace name 'WindowsAzure' does not exist in the namespace 'Microsoft' (are you missing an assembly reference?)	V:\Backup\Company Volume\Clients\AmeriWealth\Development Projects\Sites\ajaxcontroltoolkitsource\Server\AjaxControlToolkit\AjaxFileUpload\Helpers\AjaxFileUploadAzureHelper.cs	7	17	AjaxControlToolkit
    Error	2	The type or namespace name 'WindowsAzure' does not exist in the namespace 'Microsoft' (are you missing an assembly reference?)	V:\Backup\Company Volume\Clients\AmeriWealth\Development Projects\Sites\ajaxcontroltoolkitsource\Server\AjaxControlToolkit\AjaxFileUpload\Helpers\AjaxFileUploadAzureHelper.cs	8	17	AjaxControlToolkit
    Error	3	The type or namespace name 'CloudBlobClient' could not be found (are you missing a using directive or an assembly reference?)	V:\Backup\Company Volume\Clients\AmeriWealth\Development Projects\Sites\ajaxcontroltoolkitsource\Server\AjaxControlToolkit\AjaxFileUpload\Helpers\AjaxFileUploadAzureHelper.cs	200	24	AjaxControlToolkit
    Error	5	The type or namespace name 'Editor' does not exist in the namespace 'AjaxControlToolkit.HTMLEditor' (are you missing an assembly reference?)	V:\Backup\Company Volume\Clients\AmeriWealth\Development Projects\Sites\ajaxcontroltoolkitsource\SampleWebSites\AjaxControlToolkitSampleSite\App_Code\HTMLEditor.Samples.cs	5	52	V:\...\AjaxControlToolkitSampleSite\
    Error	6	The type or namespace name 'ToolbarButton' does not exist in the namespace 'AjaxControlToolkit.HTMLEditor' (are you missing an assembly reference?)	V:\Backup\Company Volume\Clients\AmeriWealth\Development Projects\Sites\ajaxcontroltoolkitsource\SampleWebSites\AjaxControlToolkitSampleSite\App_Code\HTMLEditor.CustomButtonsAndPopups.cs	25	37	V:\...\AjaxControlToolkitSampleSite\
    Error	7	The type or namespace name 'RequiredScriptAttribute' could not be found (are you missing a using directive or an assembly reference?)	V:\Backup\Company Volume\Clients\AmeriWealth\Development Projects\Sites\ajaxcontroltoolkitsource\SampleWebSites\AjaxControlToolkitSampleSite\App_Code\HTMLEditor.CustomButtonsAndPopups.cs	33	6	V:\...\AjaxControlToolkitSampleSite\
    Error	8	The type or namespace name 'RequiredScript' could not be found (are you missing a using directive or an assembly reference?)	V:\Backup\Company Volume\Clients\AmeriWealth\Development Projects\Sites\ajaxcontroltoolkitsource\SampleWebSites\AjaxControlToolkitSampleSite\App_Code\HTMLEditor.CustomButtonsAndPopups.cs	33	6	V:\...\AjaxControlToolkitSampleSite\
    Error	9	The type or namespace name 'DesignModePopupImageButton' could not be found (are you missing a using directive or an assembly reference?)	V:\Backup\Company Volume\Clients\AmeriWealth\Development Projects\Sites\ajaxcontroltoolkitsource\SampleWebSites\AjaxControlToolkitSampleSite\App_Code\HTMLEditor.CustomButtonsAndPopups.cs	35	31	V:\...\AjaxControlToolkitSampleSite\
    Error	10	The type or namespace name 'CascadingDropDownNameValue' does not exist in the namespace 'AjaxControlToolkit' (are you missing an assembly reference?)	V:\Backup\Company Volume\Clients\AmeriWealth\Development Projects\Sites\ajaxcontroltoolkitsource\SampleWebSites\AjaxControlToolkitSampleSite\App_Code\CarsService.cs	73	31	V:\...\AjaxControlToolkitSampleSite\
    Error	11	The type or namespace name 'RequiredScriptAttribute' could not be found (are you missing a using directive or an assembly reference?)	V:\Backup\Company Volume\Clients\AmeriWealth\Development Projects\Sites\ajaxcontroltoolkitsource\SampleWebSites\AjaxControlToolkitSampleSite\App_Code\HTMLEditor.CustomButtonsAndPopups.cs	96	6	V:\...\AjaxControlToolkitSampleSite\
    Error	12	The type or namespace name 'RequiredScript' could not be found (are you missing a using directive or an assembly reference?)	V:\Backup\Company Volume\Clients\AmeriWealth\Development Projects\Sites\ajaxcontroltoolkitsource\SampleWebSites\AjaxControlToolkitSampleSite\App_Code\HTMLEditor.CustomButtonsAndPopups.cs	96	6	V:\...\AjaxControlToolkitSampleSite\
    Error	13	The type or namespace name 'MethodButton' could not be found (are you missing a using directive or an assembly reference?)	V:\Backup\Company Volume\Clients\AmeriWealth\Development Projects\Sites\ajaxcontroltoolkitsource\SampleWebSites\AjaxControlToolkitSampleSite\App_Code\HTMLEditor.CustomButtonsAndPopups.cs	98	31	V:\...\AjaxControlToolkitSampleSite\
    Error	14	The type or namespace name 'Editor' does not exist in the namespace 'AjaxControlToolkit.HTMLEditor' (are you missing an assembly reference?)	V:\Backup\Company Volume\Clients\AmeriWealth\Development Projects\Sites\ajaxcontroltoolkitsource\SampleWebSites\AjaxControlToolkitSampleSite\App_Code\HTMLEditor.Samples.cs	115	60	V:\...\AjaxControlToolkitSampleSite\
    Error	15	The type or namespace name 'Editor' does not exist in the namespace 'AjaxControlToolkit.HTMLEditor' (are you missing an assembly reference?)	V:\Backup\Company Volume\Clients\AmeriWealth\Development Projects\Sites\ajaxcontroltoolkitsource\SampleWebSites\AjaxControlToolkitSampleSite\App_Code\HTMLEditor.Samples.cs	122	67	V:\...\AjaxControlToolkitSampleSite\
    Error	16	The type or namespace name 'RequiredScriptAttribute' could not be found (are you missing a using directive or an assembly reference?)	V:\Backup\Company Volume\Clients\AmeriWealth\Development Projects\Sites\ajaxcontroltoolkitsource\SampleWebSites\AjaxControlToolkitSampleSite\App_Code\HTMLEditor.CustomButtonsAndPopups.cs	130	6	V:\...\AjaxControlToolkitSampleSite\
    Error	17	The type or namespace name 'RequiredScript' could not be found (are you missing a using directive or an assembly reference?)	V:\Backup\Company Volume\Clients\AmeriWealth\Development Projects\Sites\ajaxcontroltoolkitsource\SampleWebSites\AjaxControlToolkitSampleSite\App_Code\HTMLEditor.CustomButtonsAndPopups.cs	130	6	V:\...\AjaxControlToolkitSampleSite\
    Error	18	The type or namespace name 'Popups' could not be found (are you missing a using directive or an assembly reference?)	V:\Backup\Company Volume\Clients\AmeriWealth\Development Projects\Sites\ajaxcontroltoolkitsource\SampleWebSites\AjaxControlToolkitSampleSite\App_Code\HTMLEditor.CustomButtonsAndPopups.cs	132	38	V:\...\AjaxControlToolkitSampleSite\
    Error	19	The type or namespace name 'Editor' does not exist in the namespace 'AjaxControlToolkit.HTMLEditor' (are you missing an assembly reference?)	V:\Backup\Company Volume\Clients\AmeriWealth\Development Projects\Sites\ajaxcontroltoolkitsource\SampleWebSites\AjaxControlToolkitSampleSite\App_Code\HTMLEditor.Samples.cs	133	74	V:\...\AjaxControlToolkitSampleSite\
    Error	20	Metadata file 'V:\Backup\Company Volume\Clients\AmeriWealth\Development Projects\Sites\ajaxcontroltoolkitsource\Server\AjaxControlToolkit\bin\NET45\Debug\AjaxControlToolkit.dll' could not be found	V:\Backup\Company Volume\Clients\AmeriWealth\Development Projects\Sites\ajaxcontroltoolkitsource\Server\Tests\UnitTests\CSC	UnitTests
    Error	21	Metadata file 'V:\Backup\Company Volume\Clients\AmeriWealth\Development Projects\Sites\ajaxcontroltoolkitsource\Server\AjaxControlToolkit\bin\NET45\Debug\AjaxControlToolkit.dll' could not be found	V:\Backup\Company Volume\Clients\AmeriWealth\Development Projects\Sites\ajaxcontroltoolkitsource\Server\Tests\BackwardCompatibilityTests\CSC	AjaxControlToolkit.BackwardCompatibilityTests
    Error	22	Metadata file 'V:\Backup\Company Volume\Clients\AmeriWealth\Development Projects\Sites\ajaxcontroltoolkitsource\Server\AjaxControlToolkit\bin\NET45\Debug\AjaxControlToolkit.dll' could not be found	V:\Backup\Company Volume\Clients\AmeriWealth\Development Projects\Sites\ajaxcontroltoolkitsource\Server\Tests\AjaxControlToolkitTests\CSC	AjaxControlToolkit.Tests
    

    Like I said, I really don't believe that the few changes I made are causing these errors.  The rest of the toolkit is untouched, but I cannot build.  I looked through the frequently asked questions and tried to search for these issues and am coming up short.  Perhaps there is something else that I need to install?



    Thursday, August 22, 2013 1:28 PM

Answers

All replies

  • User2075212911 posted
    Hi , Based on your error information, I think there you has not load a assembly to AjaxControlTookit.sln. For the issue , I suggest you download a complete AjaxControlTookit.sln. you can also down the latest AjaxControlTookit version and learn how to use the control HtmlEditorExtender from follow link: http://www.asp.net/ajaxLibrary/AjaxControlToolkitSampleSite hope it helps, thanks.
    Saturday, August 24, 2013 8:57 AM
  • User-1175241094 posted

    That's what I did, downloaded the entire solution and opened it in Visual Studio 2012.  I also made sure that my system is up to date with the latest version of the .net framework.  I am running on a fresh install of Visual Studio 2012 as well. 

    Saturday, August 24, 2013 3:26 PM
  • User-417640953 posted

    guitarmonster1

    Error 1 The type or namespace name 'WindowsAzure' does not exist in the namespace 'Microsoft'

    Based on your description and error information. I think your .NET platform version is set to 4.0 Client Profile by default 

    that is why you received this error. There many people come across the issue before. I suggest you change the .NET platform version to 3.5 or 4.0. 

    Below link will guide you.

    http://www.milosev.com/index.php/93-azure/252-the-type-or-namespace-name-windowsazure-does-not-exist-in-the-namespace-microsoft-are-you-missing-an-assembly-reference

    http://blogs.msdn.com/b/avkashchauhan/archive/2011/04/04/console-application-using-windows-azure-storage-client-library-with-windows-azure-sdk.aspx

     

    Hope this helps, thanks.

    Best Regards!

     

    Sunday, August 25, 2013 12:24 AM
  • User-1175241094 posted

    All projects (11 projects) are currently set on .Net Framework 4.5, I tried changing them to 4.0 and got the same result.

    Just to be thorough I closed the modified project and opened up the original as downloaded from codeplex.  So now I am working with it "as is" directly from the source, and I am still getting the errors.  Either I'm doing something wrong, or everyone who downloads this is having this issue.  I'm assuming anyone should be able to download it and compile with no issues, expecially if there were no modifications made.

    Sunday, August 25, 2013 2:01 AM
  • User-1175241094 posted

    Ok, to make this process easier I am starting over with the exact steps listed here:

    1. Downloading the source code from http://ajaxcontroltoolkit.codeplex.com/SourceControl/latest#ReadMe.html

    2. Extracting the zip file into a folder "C:\AjaxSource"

    3. Opening the solution, located at C:\AjaxSource\AjaxControlToolkit.sln

    4. I am NOT making any changes whatsoever, I am going to try to compile the solution as it was opened, removing any ability for me to mess something up

    5. Solution opened successfully.

    6. Click the 'Build' menu, then click "Build Solution"

    Following the above, I get the same exact list of errors.  So I am assuming that anyone else who follows these steps would get the same, unless there is something that I am doing wrong.

    Output from build:

    1>------ Build started: Project: MicrosoftAjax, Configuration: Debug Any CPU ------
    2>------ Build started: Project: JSBuild, Configuration: Debug Any CPU ------
    3>------ Skipped Build: Project: AjaxControlToolkit.VS2012, Configuration: Debug Any CPU ------
    3>Project not selected to build for this solution configuration 
    4>------ Skipped Build: Project: AjaxControlToolkit.VS2010, Configuration: Debug Any CPU ------
    4>Project not selected to build for this solution configuration 
    5>------ Skipped Build: Project: AjaxControlToolkit.VS2008, Configuration: Debug Any CPU ------
    5>Project not selected to build for this solution configuration 
    2>  JSBuild -> C:\AjaxSource\Tools\JSBuild\bin\NET45\Debug\JSBuild.dll
    2>  JSBuild -> C:\AjaxSource\Tools\JSBuild\bin\NET35\Debug\JSBuild.dll
    2>  JSBuild -> C:\AjaxSource\Tools\JSBuild\bin\NET40\Debug\JSBuild.dll
    1>  JSBuild: Processing MicrosoftAjaxDataContext.pre.js -> C:\AjaxSource\Client\ScriptOutput
    1>  		-> MicrosoftAjaxDataContext.debug.js [52351 bytes (51.1240234375kb)]
    1>  		-> MicrosoftAjaxDataContext.js [49525 bytes (48.3642578125kb)]
    1>  		-> MicrosoftAjaxDataContext.debug.js [51729 bytes (50.5166015625kb)]
    1>  		-> MicrosoftAjaxDataContext.js [49241 bytes (48.0869140625kb)]
    1>  JSBuild: Processing Date.HijriCalendar.pre.js -> C:\AjaxSource\Client\ScriptOutput
    1>  		-> Date.HijriCalendar.debug.js [2617 bytes (2.5556640625kb)]
    1>  		-> Date.HijriCalendar.js [2584 bytes (2.5234375kb)]
    1>  JSBuild: Processing Date.UmAlQuraCalendar.pre.js -> C:\AjaxSource\Client\ScriptOutput
    1>  		-> Date.UmAlQuraCalendar.debug.js [6200 bytes (6.0546875kb)]
    1>  		-> Date.UmAlQuraCalendar.js [6167 bytes (6.0224609375kb)]
    1>  JSBuild: Processing MicrosoftAjax.pre.js -> C:\AjaxSource\Client\ScriptOutput
    1>  		-> MicrosoftAjax.debug.js [365280 bytes (356.71875kb)]
    1>  		-> MicrosoftAjax.js [287546 bytes (280.806640625kb)]
    1>  		-> MicrosoftAjax.debug.js [356683 bytes (348.3232421875kb)]
    1>  		-> MicrosoftAjax.js [285106 bytes (278.423828125kb)]
    1>  JSBuild: Processing MicrosoftAjaxApplicationServices.pre.js -> C:\AjaxSource\Client\ScriptOutput
    1>  		-> MicrosoftAjaxApplicationServices.debug.js [31210 bytes (30.478515625kb)]
    1>  		-> MicrosoftAjaxApplicationServices.js [26482 bytes (25.861328125kb)]
    1>  JSBuild: Processing MicrosoftAjaxComponentModel.pre.js -> C:\AjaxSource\Client\ScriptOutput
    1>  		-> MicrosoftAjaxComponentModel.debug.js [94158 bytes (91.951171875kb)]
    1>  		-> MicrosoftAjaxComponentModel.js [71969 bytes (70.2822265625kb)]
    1>  JSBuild: Processing MicrosoftAjaxCore.pre.js -> C:\AjaxSource\Client\ScriptOutput
    1>  		-> MicrosoftAjaxCore.debug.js [152809 bytes (149.2275390625kb)]
    1>  		-> MicrosoftAjaxCore.js [120193 bytes (117.3759765625kb)]
    1>  		-> MicrosoftAjaxCore.debug.js [144212 bytes (140.83203125kb)]
    1>  		-> MicrosoftAjaxCore.js [117753 bytes (114.9931640625kb)]
    1>  JSBuild: Processing MicrosoftAjaxGlobalization.pre.js -> C:\AjaxSource\Client\ScriptOutput
    1>  		-> MicrosoftAjaxGlobalization.debug.js [37465 bytes (36.5869140625kb)]
    1>  		-> MicrosoftAjaxGlobalization.js [35888 bytes (35.046875kb)]
    1>  JSBuild: Processing MicrosoftAjaxHistory.pre.js -> C:\AjaxSource\Client\ScriptOutput
    1>  		-> MicrosoftAjaxHistory.debug.js [14237 bytes (13.9033203125kb)]
    1>  		-> MicrosoftAjaxHistory.js [11979 bytes (11.6982421875kb)]
    1>  JSBuild: Processing MicrosoftAjaxNetwork.pre.js -> C:\AjaxSource\Client\ScriptOutput
    1>  		-> MicrosoftAjaxNetwork.debug.js [39833 bytes (38.8994140625kb)]
    1>  		-> MicrosoftAjaxNetwork.js [26238 bytes (25.623046875kb)]
    1>  JSBuild: Processing MicrosoftAjaxSerialization.pre.js -> C:\AjaxSource\Client\ScriptOutput
    1>  		-> MicrosoftAjaxSerialization.debug.js [8747 bytes (8.5419921875kb)]
    1>  		-> MicrosoftAjaxSerialization.js [7857 bytes (7.6728515625kb)]
    1>  JSBuild: Processing MicrosoftAjaxTimer.pre.js -> C:\AjaxSource\Client\ScriptOutput
    1>  		-> MicrosoftAjaxTimer.debug.js [4713 bytes (4.6025390625kb)]
    1>  		-> MicrosoftAjaxTimer.js [4142 bytes (4.044921875kb)]
    1>  JSBuild: Processing MicrosoftAjaxWebForms.pre.js -> C:\AjaxSource\Client\ScriptOutput
    1>  		-> MicrosoftAjaxWebForms.debug.js [95562 bytes (93.322265625kb)]
    1>  		-> MicrosoftAjaxWebForms.js [89600 bytes (87.5kb)]
    1>  		-> MicrosoftAjaxWebForms.debug.js [94847 bytes (92.6240234375kb)]
    1>  		-> MicrosoftAjaxWebForms.js [88717 bytes (86.6376953125kb)]
    1>  JSBuild: Processing MicrosoftAjaxWebServices.pre.js -> C:\AjaxSource\Client\ScriptOutput
    1>  		-> MicrosoftAjaxWebServices.debug.js [20358 bytes (19.880859375kb)]
    1>  		-> MicrosoftAjaxWebServices.js [15551 bytes (15.1865234375kb)]
    1>  JSBuild: Processing Start.pre.js -> C:\AjaxSource\Client\ScriptOutput
    1>  		-> Start.debug.js [54264 bytes (52.9921875kb)]
    1>  		-> Start.js [49412 bytes (48.25390625kb)]
    1>  JSBuild: Processing MicrosoftAjaxOpenData.pre.js -> C:\AjaxSource\Client\ScriptOutput
    1>  		-> MicrosoftAjaxOpenData.debug.js [67497 bytes (65.9150390625kb)]
    1>  		-> MicrosoftAjaxOpenData.js [63902 bytes (62.404296875kb)]
    1>  		-> MicrosoftAjaxOpenData.debug.js [66380 bytes (64.82421875kb)]
    1>  		-> MicrosoftAjaxOpenData.js [63355 bytes (61.8701171875kb)]
    1>  JSBuild: Processing MicrosoftAjaxTemplates.pre.js -> C:\AjaxSource\Client\ScriptOutput
    1>  		-> MicrosoftAjaxTemplates.debug.js [141855 bytes (138.5302734375kb)]
    1>  		-> MicrosoftAjaxTemplates.js [131618 bytes (128.533203125kb)]
    1>  		-> MicrosoftAjaxTemplates.debug.js [140022 bytes (136.740234375kb)]
    1>  		-> MicrosoftAjaxTemplates.js [131451 bytes (128.3701171875kb)]
    1>  MicrosoftAjax -> C:\AjaxSource\Client\MicrosoftAjax\bin\Debug\MicrosoftAjax.dll
    6>------ Build started: Project: MicrosoftAjax.Extended, Configuration: Debug Any CPU ------
    6>  JSBuild: Processing AccordionBehavior.pre.js -> C:\AjaxSource\Client\ScriptOutput\extended\Accordion
    6>  		-> AccordionBehavior.debug.js [45276 bytes (44.21484375kb)]
    6>  		-> AccordionBehavior.js [45243 bytes (44.1826171875kb)]
    6>  JSBuild: Processing AlwaysVisibleControlBehavior.pre.js -> C:\AjaxSource\Client\ScriptOutput\extended\AlwaysVisibleControl
    6>  		-> AlwaysVisibleControlBehavior.debug.js [13502 bytes (13.185546875kb)]
    6>  		-> AlwaysVisibleControlBehavior.js [13469 bytes (13.1533203125kb)]
    6>  JSBuild: Processing AnimationBehavior.pre.js -> C:\AjaxSource\Client\ScriptOutput\extended\Animation
    6>  		-> AnimationBehavior.debug.js [14816 bytes (14.46875kb)]
    6>  		-> AnimationBehavior.js [14783 bytes (14.4365234375kb)]
    6>  JSBuild: Processing Animations.pre.js -> C:\AjaxSource\Client\ScriptOutput\extended\Animation
    6>  		-> Animations.debug.js [131078 bytes (128.005859375kb)]
    6>  		-> Animations.js [131045 bytes (127.9736328125kb)]
    6>  JSBuild: Processing AutoCompleteBehavior.pre.js -> C:\AjaxSource\Client\ScriptOutput\extended\AutoComplete
    6>  		-> AutoCompleteBehavior.debug.js [55772 bytes (54.46484375kb)]
    6>  		-> AutoCompleteBehavior.js [55739 bytes (54.4326171875kb)]
    6>  JSBuild: Processing BalloonPopupExtenderBehavior.pre.js -> C:\AjaxSource\Client\ScriptOutput\extended\BalloonPopup
    6>  		-> BalloonPopupExtenderBehavior.debug.js [44681 bytes (43.6337890625kb)]
    6>  		-> BalloonPopupExtenderBehavior.js [44648 bytes (43.6015625kb)]
    6>  JSBuild: Processing CalendarBehavior.pre.js -> C:\AjaxSource\Client\ScriptOutput\extended\Calendar
    6>  		-> CalendarBehavior.debug.js [83222 bytes (81.271484375kb)]
    6>  		-> CalendarBehavior.js [83189 bytes (81.2392578125kb)]
    6>  JSBuild: Processing CascadingDropDownBehavior.pre.js -> C:\AjaxSource\Client\ScriptOutput\extended\CascadingDropDown
    6>  		-> CascadingDropDownBehavior.debug.js [31229 bytes (30.4970703125kb)]
    6>  		-> CascadingDropDownBehavior.js [31196 bytes (30.46484375kb)]
    6>  JSBuild: Processing CollapsiblePanelBehavior.pre.js -> C:\AjaxSource\Client\ScriptOutput\extended\CollapsiblePanel
    6>  		-> CollapsiblePanelBehavior.debug.js [40231 bytes (39.2880859375kb)]
    6>  		-> CollapsiblePanelBehavior.js [40198 bytes (39.255859375kb)]
    6>  JSBuild: Processing ColorPickerBehavior.pre.js -> C:\AjaxSource\Client\ScriptOutput\extended\ColorPicker
    6>  		-> ColorPickerBehavior.debug.js [20249 bytes (19.7744140625kb)]
    6>  		-> ColorPickerBehavior.js [20216 bytes (19.7421875kb)]
    6>  JSBuild: Processing Common.pre.js -> C:\AjaxSource\Client\ScriptOutput\extended\Common
    6>  		-> Common.debug.js [63616 bytes (62.125kb)]
    6>  		-> Common.js [63583 bytes (62.0927734375kb)]
    6>  JSBuild: Processing DateTime.pre.js -> C:\AjaxSource\Client\ScriptOutput\extended\Common
    6>  		-> DateTime.debug.js [19224 bytes (18.7734375kb)]
    6>  		-> DateTime.js [19191 bytes (18.7412109375kb)]
    6>  JSBuild: Processing Threading.pre.js -> C:\AjaxSource\Client\ScriptOutput\extended\Common
    6>  		-> Threading.debug.js [8535 bytes (8.3349609375kb)]
    6>  		-> Threading.js [8502 bytes (8.302734375kb)]
    6>  JSBuild: Processing DragDropScripts.pre.js -> C:\AjaxSource\Client\ScriptOutput\extended\Compat\DragDrop
    6>  		-> DragDropScripts.debug.js [28791 bytes (28.1162109375kb)]
    6>  		-> DragDropScripts.js [28758 bytes (28.083984375kb)]
    6>  JSBuild: Processing Timer.pre.js -> C:\AjaxSource\Client\ScriptOutput\extended\Compat\Timer
    6>  		-> Timer.debug.js [3201 bytes (3.1259765625kb)]
    6>  		-> Timer.js [3168 bytes (3.09375kb)]
    6>  JSBuild: Processing confirmButtonBehavior.pre.js -> C:\AjaxSource\Client\ScriptOutput\extended\ConfirmButton
    6>  		-> confirmButtonBehavior.debug.js [12547 bytes (12.2529296875kb)]
    6>  		-> confirmButtonBehavior.js [12514 bytes (12.220703125kb)]
    6>  JSBuild: Processing FloatingBehavior.pre.js -> C:\AjaxSource\Client\ScriptOutput\extended\DragPanel
    6>  		-> FloatingBehavior.debug.js [5718 bytes (5.583984375kb)]
    6>  		-> FloatingBehavior.js [5685 bytes (5.5517578125kb)]
    6>  JSBuild: Processing DropDownBehavior.pre.js -> C:\AjaxSource\Client\ScriptOutput\extended\DropDown
    6>  		-> DropDownBehavior.debug.js [28924 bytes (28.24609375kb)]
    6>  		-> DropDownBehavior.js [28891 bytes (28.2138671875kb)]
    6>  JSBuild: Processing DropShadowBehavior.pre.js -> C:\AjaxSource\Client\ScriptOutput\extended\DropShadow
    6>  		-> DropShadowBehavior.debug.js [17278 bytes (16.873046875kb)]
    6>  		-> DropShadowBehavior.js [17245 bytes (16.8408203125kb)]
    6>  JSBuild: Processing DynamicPopulateBehavior.pre.js -> C:\AjaxSource\Client\ScriptOutput\extended\DynamicPopulate
    6>  		-> DynamicPopulateBehavior.debug.js [15094 bytes (14.740234375kb)]
    6>  		-> DynamicPopulateBehavior.js [15061 bytes (14.7080078125kb)]
    6>  JSBuild: Processing ExtendedControls.pre.js -> C:\AjaxSource\Client\ScriptOutput\extended
    6>  		-> ExtendedControls.debug.js [13730 bytes (13.408203125kb)]
    6>  		-> ExtendedControls.js [13697 bytes (13.3759765625kb)]
    6>  JSBuild: Processing BaseScripts.pre.js -> C:\AjaxSource\Client\ScriptOutput\extended\ExtenderBase
    6>  		-> BaseScripts.debug.js [33516 bytes (32.73046875kb)]
    6>  		-> BaseScripts.js [33483 bytes (32.6982421875kb)]
    6>  		-> BaseScripts.debug.js [21477 bytes (20.9736328125kb)]
    6>  		-> BaseScripts.js [21444 bytes (20.94140625kb)]
    6>  		-> BaseScripts.debug.ar.js [33521 bytes (32.7353515625kb)]
    6>  		-> BaseScripts.ar.js [33488 bytes (32.703125kb)]
    6>  		-> BaseScripts.debug.cs.js [33601 bytes (32.8134765625kb)]
    6>  		-> BaseScripts.cs.js [33568 bytes (32.78125kb)]
    6>  		-> BaseScripts.debug.de.js [33516 bytes (32.73046875kb)]
    6>  		-> BaseScripts.de.js [33483 bytes (32.6982421875kb)]
    6>  		-> BaseScripts.debug.es.js [33514 bytes (32.728515625kb)]
    6>  		-> BaseScripts.es.js [33481 bytes (32.6962890625kb)]
    6>  		-> BaseScripts.debug.fr.js [33680 bytes (32.890625kb)]
    6>  		-> BaseScripts.fr.js [33647 bytes (32.8583984375kb)]
    6>  		-> BaseScripts.debug.he.js [33519 bytes (32.7333984375kb)]
    6>  		-> BaseScripts.he.js [33486 bytes (32.701171875kb)]
    6>  		-> BaseScripts.debug.it.js [33515 bytes (32.7294921875kb)]
    6>  		-> BaseScripts.it.js [33482 bytes (32.697265625kb)]
    6>  		-> BaseScripts.debug.ja.js [33517 bytes (32.7314453125kb)]
    6>  		-> BaseScripts.ja.js [33484 bytes (32.69921875kb)]
    6>  		-> BaseScripts.debug.ko.js [33517 bytes (32.7314453125kb)]
    6>  		-> BaseScripts.ko.js [33484 bytes (32.69921875kb)]
    6>  		-> BaseScripts.debug.nl.js [33810 bytes (33.017578125kb)]
    6>  		-> BaseScripts.nl.js [33777 bytes (32.9853515625kb)]
    6>  		-> BaseScripts.debug.pl.js [33518 bytes (32.732421875kb)]
    6>  		-> BaseScripts.pl.js [33485 bytes (32.7001953125kb)]
    6>  		-> BaseScripts.debug.pt.js [33515 bytes (32.7294921875kb)]
    6>  		-> BaseScripts.pt.js [33482 bytes (32.697265625kb)]
    6>  		-> BaseScripts.debug.ru.js [36005 bytes (35.1611328125kb)]
    6>  		-> BaseScripts.ru.js [35972 bytes (35.12890625kb)]
    6>  		-> BaseScripts.debug.hi.js [33517 bytes (32.7314453125kb)]
    6>  		-> BaseScripts.hi.js [33484 bytes (32.69921875kb)]
    6>  		-> BaseScripts.debug.tr-TR.js [33778 bytes (32.986328125kb)]
    6>  		-> BaseScripts.tr-TR.js [33745 bytes (32.9541015625kb)]
    6>  		-> BaseScripts.debug.zh-CHS.js [33298 bytes (32.517578125kb)]
    6>  		-> BaseScripts.zh-CHS.js [33265 bytes (32.4853515625kb)]
    6>  		-> BaseScripts.debug.zh-CHT.js [33331 bytes (32.5498046875kb)]
    6>  		-> BaseScripts.zh-CHT.js [33298 bytes (32.517578125kb)]
    6>  JSBuild: Processing FilteredTextBoxBehavior.pre.js -> C:\AjaxSource\Client\ScriptOutput\extended\FilteredTextBox
    6>  		-> FilteredTextBoxBehavior.debug.js [18048 bytes (17.625kb)]
    6>  		-> FilteredTextBoxBehavior.js [18015 bytes (17.5927734375kb)]
    6>  JSBuild: Processing HoverBehavior.pre.js -> C:\AjaxSource\Client\ScriptOutput\extended\HoverExtender
    6>  		-> HoverBehavior.debug.js [8051 bytes (7.8623046875kb)]
    6>  		-> HoverBehavior.js [8018 bytes (7.830078125kb)]
    6>  JSBuild: Processing HoverMenuBehavior.pre.js -> C:\AjaxSource\Client\ScriptOutput\extended\HoverMenu
    6>  		-> HoverMenuBehavior.debug.js [19914 bytes (19.447265625kb)]
    6>  		-> HoverMenuBehavior.js [19881 bytes (19.4150390625kb)]
    6>  JSBuild: Processing HtmlEditorExtenderBehavior.Pre.js -> C:\AjaxSource\Client\ScriptOutput\extended\HtmlEditorExtender
    6>  		-> HtmlEditorExtenderBehavior.debug.js [51671 bytes (50.4599609375kb)]
    6>  		-> HtmlEditorExtenderBehavior.js [51638 bytes (50.427734375kb)]
    6>  JSBuild: Processing ListSearchBehavior.pre.js -> C:\AjaxSource\Client\ScriptOutput\extended\ListSearch
    6>  		-> ListSearchBehavior.debug.js [29983 bytes (29.2802734375kb)]
    6>  		-> ListSearchBehavior.js [29950 bytes (29.248046875kb)]
    6>  JSBuild: Processing MaskedEditBehavior.pre.js -> C:\AjaxSource\Client\ScriptOutput\extended\MaskedEdit
    6>  		-> MaskedEditBehavior.debug.js [160025 bytes (156.2744140625kb)]
    6>  		-> MaskedEditBehavior.js [159992 bytes (156.2421875kb)]
    6>  JSBuild: Processing MaskedEditValidator.pre.js -> C:\AjaxSource\Client\ScriptOutput\extended\MaskedEdit
    6>  		-> MaskedEditValidator.debug.js [24891 bytes (24.3076171875kb)]
    6>  		-> MaskedEditValidator.js [24858 bytes (24.275390625kb)]
    6>  JSBuild: Processing ModalPopupBehavior.pre.js -> C:\AjaxSource\Client\ScriptOutput\extended\ModalPopup
    6>  		-> ModalPopupBehavior.debug.js [38747 bytes (37.8388671875kb)]
    6>  		-> ModalPopupBehavior.js [38714 bytes (37.806640625kb)]
    6>  JSBuild: Processing MultiHandleSliderBehavior.pre.js -> C:\AjaxSource\Client\ScriptOutput\extended\MultiHandleSlider
    6>  		-> MultiHandleSliderBehavior.debug.js [92374 bytes (90.208984375kb)]
    6>  		-> MultiHandleSliderBehavior.js [92341 bytes (90.1767578125kb)]
    6>  JSBuild: Processing MutuallyExclusiveCheckBoxBehavior.pre.js -> C:\AjaxSource\Client\ScriptOutput\extended\MutuallyExclusiveCheckBox
    6>  		-> MutuallyExclusiveCheckBoxBehavior.debug.js [6720 bytes (6.5625kb)]
    6>  		-> MutuallyExclusiveCheckBoxBehavior.js [6687 bytes (6.5302734375kb)]
    6>  JSBuild: Processing NumericUpDownBehavior.pre.js -> C:\AjaxSource\Client\ScriptOutput\extended\NumericUpDown
    6>  		-> NumericUpDownBehavior.debug.js [23433 bytes (22.8837890625kb)]
    6>  		-> NumericUpDownBehavior.js [23400 bytes (22.8515625kb)]
    6>  JSBuild: Processing PagingBulletedListBehavior.pre.js -> C:\AjaxSource\Client\ScriptOutput\extended\PagingBulletedList
    6>  		-> PagingBulletedListBehavior.debug.js [19449 bytes (18.9931640625kb)]
    6>  		-> PagingBulletedListBehavior.js [19416 bytes (18.9609375kb)]
    6>  JSBuild: Processing PasswordStrengthExtenderBehavior.pre.js -> C:\AjaxSource\Client\ScriptOutput\extended\PasswordStrength
    6>  		-> PasswordStrengthExtenderBehavior.debug.js [33640 bytes (32.8515625kb)]
    6>  		-> PasswordStrengthExtenderBehavior.js [33607 bytes (32.8193359375kb)]
    6>  JSBuild: Processing PopupControlBehavior.pre.js -> C:\AjaxSource\Client\ScriptOutput\extended\PopupControl
    6>  		-> PopupControlBehavior.debug.js [22047 bytes (21.5302734375kb)]
    6>  		-> PopupControlBehavior.js [22014 bytes (21.498046875kb)]
    6>  JSBuild: Processing PopupBehavior.pre.js -> C:\AjaxSource\Client\ScriptOutput\extended\PopupExtender
    6>  		-> PopupBehavior.debug.js [27923 bytes (27.2685546875kb)]
    6>  		-> PopupBehavior.js [27890 bytes (27.236328125kb)]
    6>  JSBuild: Processing RatingBehavior.pre.js -> C:\AjaxSource\Client\ScriptOutput\extended\Rating
    6>  		-> RatingBehavior.debug.js [20593 bytes (20.1103515625kb)]
    6>  		-> RatingBehavior.js [20560 bytes (20.078125kb)]
    6>  JSBuild: Processing ResizableControlBehavior.pre.js -> C:\AjaxSource\Client\ScriptOutput\extended\ResizableControl
    6>  		-> ResizableControlBehavior.debug.js [21568 bytes (21.0625kb)]
    6>  		-> ResizableControlBehavior.js [21535 bytes (21.0302734375kb)]
    6>  JSBuild: Processing RoundedCornersBehavior.pre.js -> C:\AjaxSource\Client\ScriptOutput\extended\RoundedCorners
    6>  		-> RoundedCornersBehavior.debug.js [20444 bytes (19.96484375kb)]
    6>  		-> RoundedCornersBehavior.js [20411 bytes (19.9326171875kb)]
    6>  JSBuild: Processing Seadragon.Buttons.pre.js -> C:\AjaxSource\Client\ScriptOutput\extended\Seadragon
    6>  		-> Seadragon.Buttons.debug.js [12369 bytes (12.0791015625kb)]
    6>  		-> Seadragon.Buttons.js [12336 bytes (12.046875kb)]
    6>  JSBuild: Processing Seadragon.Config.pre.js -> C:\AjaxSource\Client\ScriptOutput\extended\Seadragon
    6>  		-> Seadragon.Config.debug.js [2456 bytes (2.3984375kb)]
    6>  		-> Seadragon.Config.js [2423 bytes (2.3662109375kb)]
    6>  JSBuild: Processing Seadragon.DeepZoom.pre.js -> C:\AjaxSource\Client\ScriptOutput\extended\Seadragon
    6>  		-> Seadragon.DeepZoom.debug.js [9009 bytes (8.7978515625kb)]
    6>  		-> Seadragon.DeepZoom.js [8976 bytes (8.765625kb)]
    6>  JSBuild: Processing Seadragon.DisplayRect.pre.js -> C:\AjaxSource\Client\ScriptOutput\extended\Seadragon
    6>  		-> Seadragon.DisplayRect.debug.js [461 bytes (0.4501953125kb)]
    6>  		-> Seadragon.DisplayRect.js [428 bytes (0.41796875kb)]
    6>  JSBuild: Processing Seadragon.Drawer.pre.js -> C:\AjaxSource\Client\ScriptOutput\extended\Seadragon
    6>  		-> Seadragon.Drawer.debug.js [27548 bytes (26.90234375kb)]
    6>  		-> Seadragon.Drawer.js [27515 bytes (26.8701171875kb)]
    6>  JSBuild: Processing Seadragon.ImageLoader.pre.js -> C:\AjaxSource\Client\ScriptOutput\extended\Seadragon
    6>  		-> Seadragon.ImageLoader.debug.js [2597 bytes (2.5361328125kb)]
    6>  		-> Seadragon.ImageLoader.js [2564 bytes (2.50390625kb)]
    6>  JSBuild: Processing Seadragon.MouseTracker.pre.js -> C:\AjaxSource\Client\ScriptOutput\extended\Seadragon
    6>  		-> Seadragon.MouseTracker.debug.js [11887 bytes (11.6083984375kb)]
    6>  		-> Seadragon.MouseTracker.js [11854 bytes (11.576171875kb)]
    6>  JSBuild: Processing Seadragon.Point.pre.js -> C:\AjaxSource\Client\ScriptOutput\extended\Seadragon
    6>  		-> Seadragon.Point.debug.js [1613 bytes (1.5751953125kb)]
    6>  		-> Seadragon.Point.js [1580 bytes (1.54296875kb)]
    6>  JSBuild: Processing Seadragon.pre.js -> C:\AjaxSource\Client\ScriptOutput\extended\Seadragon
    6>  		-> Seadragon.debug.js [35964 bytes (35.12109375kb)]
    6>  		-> Seadragon.js [35931 bytes (35.0888671875kb)]
    6>  JSBuild: Processing Seadragon.Profiler.pre.js -> C:\AjaxSource\Client\ScriptOutput\extended\Seadragon
    6>  		-> Seadragon.Profiler.debug.js [2904 bytes (2.8359375kb)]
    6>  		-> Seadragon.Profiler.js [2871 bytes (2.8037109375kb)]
    6>  JSBuild: Processing Seadragon.Rect.pre.js -> C:\AjaxSource\Client\ScriptOutput\extended\Seadragon
    6>  		-> Seadragon.Rect.debug.js [1514 bytes (1.478515625kb)]
    6>  		-> Seadragon.Rect.js [1481 bytes (1.4462890625kb)]
    6>  JSBuild: Processing Seadragon.Spring.pre.js -> C:\AjaxSource\Client\ScriptOutput\extended\Seadragon
    6>  		-> Seadragon.Spring.debug.js [1835 bytes (1.7919921875kb)]
    6>  		-> Seadragon.Spring.js [1802 bytes (1.759765625kb)]
    6>  JSBuild: Processing Seadragon.Strings.pre.js -> C:\AjaxSource\Client\ScriptOutput\extended\Seadragon
    6>  		-> Seadragon.Strings.debug.js [2177 bytes (2.1259765625kb)]
    6>  		-> Seadragon.Strings.js [2144 bytes (2.09375kb)]
    6>  JSBuild: Processing Seadragon.TileSource.pre.js -> C:\AjaxSource\Client\ScriptOutput\extended\Seadragon
    6>  		-> Seadragon.TileSource.debug.js [2771 bytes (2.7060546875kb)]
    6>  		-> Seadragon.TileSource.js [2738 bytes (2.673828125kb)]
    6>  JSBuild: Processing Seadragon.Utils.pre.js -> C:\AjaxSource\Client\ScriptOutput\extended\Seadragon
    6>  		-> Seadragon.Utils.debug.js [15095 bytes (14.7412109375kb)]
    6>  		-> Seadragon.Utils.js [15062 bytes (14.708984375kb)]
    6>  JSBuild: Processing Seadragon.Viewport.pre.js -> C:\AjaxSource\Client\ScriptOutput\extended\Seadragon
    6>  		-> Seadragon.Viewport.debug.js [9278 bytes (9.060546875kb)]
    6>  		-> Seadragon.Viewport.js [9245 bytes (9.0283203125kb)]
    6>  JSBuild: Processing SliderBehavior.pre.js -> C:\AjaxSource\Client\ScriptOutput\extended\Slider
    6>  		-> SliderBehavior.debug.js [31174 bytes (30.443359375kb)]
    6>  		-> SliderBehavior.js [31141 bytes (30.4111328125kb)]
    6>  JSBuild: Processing SlideShowBehavior.pre.js -> C:\AjaxSource\Client\ScriptOutput\extended\SlideShow
    6>  		-> SlideShowBehavior.debug.js [56275 bytes (54.9560546875kb)]
    6>  		-> SlideShowBehavior.js [56242 bytes (54.923828125kb)]
    6>  JSBuild: Processing Tabs.pre.js -> C:\AjaxSource\Client\ScriptOutput\extended\Tabs
    6>  		-> Tabs.debug.js [36532 bytes (35.67578125kb)]
    6>  		-> Tabs.js [36499 bytes (35.6435546875kb)]
    6>  JSBuild: Processing TextboxWatermark.pre.js -> C:\AjaxSource\Client\ScriptOutput\extended\TextboxWatermark
    6>  		-> TextboxWatermark.debug.js [13409 bytes (13.0947265625kb)]
    6>  		-> TextboxWatermark.js [13376 bytes (13.0625kb)]
    6>  JSBuild: Processing ToggleButton.pre.js -> C:\AjaxSource\Client\ScriptOutput\extended\ToggleButton
    6>  		-> ToggleButton.debug.js [14166 bytes (13.833984375kb)]
    6>  		-> ToggleButton.js [14133 bytes (13.8017578125kb)]
    6>  JSBuild: Processing UpdatePanelAnimationBehavior.pre.js -> C:\AjaxSource\Client\ScriptOutput\extended\UpdatePanelAnimation
    6>  		-> UpdatePanelAnimationBehavior.debug.js [7263 bytes (7.0927734375kb)]
    6>  		-> UpdatePanelAnimationBehavior.js [7230 bytes (7.060546875kb)]
    6>  JSBuild: Processing ValidatorCalloutBehavior.pre.js -> C:\AjaxSource\Client\ScriptOutput\extended\ValidatorCallout
    6>  		-> ValidatorCalloutBehavior.debug.js [21914 bytes (21.400390625kb)]
    6>  		-> ValidatorCalloutBehavior.js [21881 bytes (21.3681640625kb)]
    6>  MicrosoftAjax.Extended -> C:\AjaxSource\Client\MicrosoftAjax.Extended\bin\Debug\MicrosoftAjax.Extended.dll
    7>------ Build started: Project: AjaxControlToolkit, Configuration: Debug Any CPU ------
    7>  JSBuild: Processing AjaxFileUpload.CompleteAllEventArgs.pre.js -> C:\AjaxSource\Server\AjaxControlToolkit\ScriptOutput\AjaxFileUpload
    7>  		-> AjaxFileUpload.CompleteAllEventArgs.debug.js [951 bytes (0.9287109375kb)]
    7>  		-> AjaxFileUpload.CompleteAllEventArgs.js [951 bytes (0.9287109375kb)]
    7>  JSBuild: Processing AjaxFileUpload.Control.pre.js -> C:\AjaxSource\Server\AjaxControlToolkit\ScriptOutput\AjaxFileUpload
    7>  		-> AjaxFileUpload.Control.debug.js [21632 bytes (21.125kb)]
    7>  		-> AjaxFileUpload.Control.js [21632 bytes (21.125kb)]
    7>  JSBuild: Processing AjaxFileUpload.EventArgs.pre.js -> C:\AjaxSource\Server\AjaxControlToolkit\ScriptOutput\AjaxFileUpload
    7>  		-> AjaxFileUpload.EventArgs.debug.js [1445 bytes (1.4111328125kb)]
    7>  		-> AjaxFileUpload.EventArgs.js [1445 bytes (1.4111328125kb)]
    7>  JSBuild: Processing AjaxFileUpload.Item.pre.js -> C:\AjaxSource\Server\AjaxControlToolkit\ScriptOutput\AjaxFileUpload
    7>  		-> AjaxFileUpload.Item.debug.js [5204 bytes (5.08203125kb)]
    7>  		-> AjaxFileUpload.Item.js [5204 bytes (5.08203125kb)]
    7>  JSBuild: Processing AjaxFileUpload.Processor.pre.js -> C:\AjaxSource\Server\AjaxControlToolkit\ScriptOutput\AjaxFileUpload
    7>  		-> AjaxFileUpload.Processor.debug.js [9700 bytes (9.47265625kb)]
    7>  		-> AjaxFileUpload.Processor.js [9700 bytes (9.47265625kb)]
    7>  JSBuild: Processing AjaxFileUpload.ProcessorHtml5.pre.js -> C:\AjaxSource\Server\AjaxControlToolkit\ScriptOutput\AjaxFileUpload
    7>  		-> AjaxFileUpload.ProcessorHtml5.debug.js [8619 bytes (8.4169921875kb)]
    7>  		-> AjaxFileUpload.ProcessorHtml5.js [8619 bytes (8.4169921875kb)]
    7>  JSBuild: Processing AjaxFileUpload.StartEventArgs.pre.js -> C:\AjaxSource\Server\AjaxControlToolkit\ScriptOutput\AjaxFileUpload
    7>  		-> AjaxFileUpload.StartEventArgs.debug.js [676 bytes (0.66015625kb)]
    7>  		-> AjaxFileUpload.StartEventArgs.js [676 bytes (0.66015625kb)]
    7>  JSBuild: Processing AjaxFileUpload.Utils.pre.js -> C:\AjaxSource\Server\AjaxControlToolkit\ScriptOutput\AjaxFileUpload
    7>  		-> AjaxFileUpload.Utils.debug.js [2556 bytes (2.49609375kb)]
    7>  		-> AjaxFileUpload.Utils.js [2556 bytes (2.49609375kb)]
    7>  JSBuild: Processing AreaChart.pre.js -> C:\AjaxSource\Server\AjaxControlToolkit\ScriptOutput\AreaChart
    7>  		-> AreaChart.debug.js [22538 bytes (22.009765625kb)]
    7>  		-> AreaChart.js [22538 bytes (22.009765625kb)]
    7>  JSBuild: Processing AsyncFileUpload.pre.js -> C:\AjaxSource\Server\AjaxControlToolkit\ScriptOutput\AsyncFileUpload
    7>  		-> AsyncFileUpload.debug.js [17414 bytes (17.005859375kb)]
    7>  		-> AsyncFileUpload.js [17414 bytes (17.005859375kb)]
    7>  JSBuild: Processing BarChart.pre.js -> C:\AjaxSource\Server\AjaxControlToolkit\ScriptOutput\BarChart
    7>  		-> BarChart.debug.js [42060 bytes (41.07421875kb)]
    7>  		-> BarChart.js [42060 bytes (41.07421875kb)]
    7>  JSBuild: Processing BubbleChart.pre.js -> C:\AjaxSource\Server\AjaxControlToolkit\ScriptOutput\BubbleChart
    7>  		-> BubbleChart.debug.js [23887 bytes (23.3271484375kb)]
    7>  		-> BubbleChart.js [23887 bytes (23.3271484375kb)]
    7>  JSBuild: Processing ComboBox.pre.js -> C:\AjaxSource\Server\AjaxControlToolkit\ScriptOutput\ComboBox
    7>  		-> ComboBox.debug.js [58242 bytes (56.876953125kb)]
    7>  		-> ComboBox.js [58242 bytes (56.876953125kb)]
    7>  JSBuild: Processing DesignPanel.pre.js -> C:\AjaxSource\Server\AjaxControlToolkit\ScriptOutput\HTMLEditor
    7>  		-> DesignPanel.debug.js [122518 bytes (119.646484375kb)]
    7>  		-> DesignPanel.js [122518 bytes (119.646484375kb)]
    7>  JSBuild: Processing DesignPanelEventHandler.pre.js -> C:\AjaxSource\Server\AjaxControlToolkit\ScriptOutput\HTMLEditor
    7>  		-> DesignPanelEventHandler.debug.js [59803 bytes (58.4013671875kb)]
    7>  		-> DesignPanelEventHandler.js [59803 bytes (58.4013671875kb)]
    7>  JSBuild: Processing Editor.pre.js -> C:\AjaxSource\Server\AjaxControlToolkit\ScriptOutput\HTMLEditor
    7>  		-> Editor.debug.js [6365 bytes (6.2158203125kb)]
    7>  		-> Editor.js [6365 bytes (6.2158203125kb)]
    7>  JSBuild: Processing EditPanel.pre.js -> C:\AjaxSource\Server\AjaxControlToolkit\ScriptOutput\HTMLEditor
    7>  		-> EditPanel.debug.js [22649 bytes (22.1181640625kb)]
    7>  		-> EditPanel.js [22649 bytes (22.1181640625kb)]
    7>  JSBuild: Processing Enums.pre.js -> C:\AjaxSource\Server\AjaxControlToolkit\ScriptOutput\HTMLEditor
    7>  		-> Enums.debug.js [491 bytes (0.4794921875kb)]
    7>  		-> Enums.js [491 bytes (0.4794921875kb)]
    7>  JSBuild: Processing Events.pre.js -> C:\AjaxSource\Server\AjaxControlToolkit\ScriptOutput\HTMLEditor
    7>  		-> Events.debug.js [900 bytes (0.87890625kb)]
    7>  		-> Events.js [900 bytes (0.87890625kb)]
    7>  JSBuild: Processing ExecCommandEmulation.pre.js -> C:\AjaxSource\Server\AjaxControlToolkit\ScriptOutput\HTMLEditor
    7>  		-> ExecCommandEmulation.debug.js [80125 bytes (78.2470703125kb)]
    7>  		-> ExecCommandEmulation.js [80125 bytes (78.2470703125kb)]
    7>  JSBuild: Processing HTMLEditor.pre.js -> C:\AjaxSource\Server\AjaxControlToolkit\ScriptOutput\HTMLEditor
    7>  		-> HTMLEditor.debug.js [89317 bytes (87.2236328125kb)]
    7>  		-> HTMLEditor.js [89317 bytes (87.2236328125kb)]
    7>  JSBuild: Processing HtmlPanel.pre.js -> C:\AjaxSource\Server\AjaxControlToolkit\ScriptOutput\HTMLEditor
    7>  		-> HtmlPanel.debug.js [3595 bytes (3.5107421875kb)]
    7>  		-> HtmlPanel.js [3595 bytes (3.5107421875kb)]
    7>  JSBuild: Processing ModePanel.pre.js -> C:\AjaxSource\Server\AjaxControlToolkit\ScriptOutput\HTMLEditor
    7>  		-> ModePanel.debug.js [3541 bytes (3.4580078125kb)]
    7>  		-> ModePanel.js [3541 bytes (3.4580078125kb)]
    7>  JSBuild: Processing AttachedPopup.pre.js -> C:\AjaxSource\Server\AjaxControlToolkit\ScriptOutput\HTMLEditor\Popups
    7>  		-> AttachedPopup.debug.js [3283 bytes (3.2060546875kb)]
    7>  		-> AttachedPopup.js [3283 bytes (3.2060546875kb)]
    7>  JSBuild: Processing AttachedTemplatePopup.pre.js -> C:\AjaxSource\Server\AjaxControlToolkit\ScriptOutput\HTMLEditor\Popups
    7>  		-> AttachedTemplatePopup.debug.js [1041 bytes (1.0166015625kb)]
    7>  		-> AttachedTemplatePopup.js [1041 bytes (1.0166015625kb)]
    7>  JSBuild: Processing BaseColorsPopup.pre.js -> C:\AjaxSource\Server\AjaxControlToolkit\ScriptOutput\HTMLEditor\Popups
    7>  		-> BaseColorsPopup.debug.js [476 bytes (0.46484375kb)]
    7>  		-> BaseColorsPopup.js [476 bytes (0.46484375kb)]
    7>  JSBuild: Processing LinkProperties.pre.js -> C:\AjaxSource\Server\AjaxControlToolkit\ScriptOutput\HTMLEditor\Popups
    7>  		-> LinkProperties.debug.js [761 bytes (0.7431640625kb)]
    7>  		-> LinkProperties.js [761 bytes (0.7431640625kb)]
    7>  JSBuild: Processing OkCancelAttachedTemplatePopup.pre.js -> C:\AjaxSource\Server\AjaxControlToolkit\ScriptOutput\HTMLEditor\Popups
    7>  		-> OkCancelAttachedTemplatePopup.debug.js [847 bytes (0.8271484375kb)]
    7>  		-> OkCancelAttachedTemplatePopup.js [847 bytes (0.8271484375kb)]
    7>  JSBuild: Processing Popup.pre.js -> C:\AjaxSource\Server\AjaxControlToolkit\ScriptOutput\HTMLEditor\Popups
    7>  		-> Popup.debug.js [10065 bytes (9.8291015625kb)]
    7>  		-> Popup.js [10065 bytes (9.8291015625kb)]
    7>  JSBuild: Processing PopupBGIButton.pre.js -> C:\AjaxSource\Server\AjaxControlToolkit\ScriptOutput\HTMLEditor\Popups
    7>  		-> PopupBGIButton.debug.js [466 bytes (0.455078125kb)]
    7>  		-> PopupBGIButton.js [466 bytes (0.455078125kb)]
    7>  JSBuild: Processing PopupBoxButton.pre.js -> C:\AjaxSource\Server\AjaxControlToolkit\ScriptOutput\HTMLEditor\Popups
    7>  		-> PopupBoxButton.debug.js [502 bytes (0.490234375kb)]
    7>  		-> PopupBoxButton.js [502 bytes (0.490234375kb)]
    7>  JSBuild: Processing PopupCommonButton.pre.js -> C:\AjaxSource\Server\AjaxControlToolkit\ScriptOutput\HTMLEditor\Popups
    7>  		-> PopupCommonButton.debug.js [6572 bytes (6.41796875kb)]
    7>  		-> PopupCommonButton.js [6572 bytes (6.41796875kb)]
    7>  JSBuild: Processing PreviewPanel.pre.js -> C:\AjaxSource\Server\AjaxControlToolkit\ScriptOutput\HTMLEditor
    7>  		-> PreviewPanel.debug.js [3397 bytes (3.3173828125kb)]
    7>  		-> PreviewPanel.js [3397 bytes (3.3173828125kb)]
    7>  JSBuild: Processing Toolbar.pre.js -> C:\AjaxSource\Server\AjaxControlToolkit\ScriptOutput\HTMLEditor
    7>  		-> Toolbar.debug.js [2963 bytes (2.8935546875kb)]
    7>  		-> Toolbar.js [2963 bytes (2.8935546875kb)]
    7>  JSBuild: Processing BackColorClear.pre.js -> C:\AjaxSource\Server\AjaxControlToolkit\ScriptOutput\HTMLEditor\Toolbar_buttons
    7>  		-> BackColorClear.debug.js [735 bytes (0.7177734375kb)]
    7>  		-> BackColorClear.js [735 bytes (0.7177734375kb)]
    7>  JSBuild: Processing BackColorSelector.pre.js -> C:\AjaxSource\Server\AjaxControlToolkit\ScriptOutput\HTMLEditor\Toolbar_buttons
    7>  		-> BackColorSelector.debug.js [916 bytes (0.89453125kb)]
    7>  		-> BackColorSelector.js [916 bytes (0.89453125kb)]
    7>  JSBuild: Processing Bold.pre.js -> C:\AjaxSource\Server\AjaxControlToolkit\ScriptOutput\HTMLEditor\Toolbar_buttons
    7>  		-> Bold.debug.js [894 bytes (0.873046875kb)]
    7>  		-> Bold.js [894 bytes (0.873046875kb)]
    7>  JSBuild: Processing BoxButton.pre.js -> C:\AjaxSource\Server\AjaxControlToolkit\ScriptOutput\HTMLEditor\Toolbar_buttons
    7>  		-> BoxButton.debug.js [622 bytes (0.607421875kb)]
    7>  		-> BoxButton.js [622 bytes (0.607421875kb)]
    7>  JSBuild: Processing BulletedList.pre.js -> C:\AjaxSource\Server\AjaxControlToolkit\ScriptOutput\HTMLEditor\Toolbar_buttons
    7>  		-> BulletedList.debug.js [722 bytes (0.705078125kb)]
    7>  		-> BulletedList.js [722 bytes (0.705078125kb)]
    7>  JSBuild: Processing ColorButton.pre.js -> C:\AjaxSource\Server\AjaxControlToolkit\ScriptOutput\HTMLEditor\Toolbar_buttons
    7>  		-> ColorButton.debug.js [973 bytes (0.9501953125kb)]
    7>  		-> ColorButton.js [973 bytes (0.9501953125kb)]
    7>  JSBuild: Processing ColorSelector.pre.js -> C:\AjaxSource\Server\AjaxControlToolkit\ScriptOutput\HTMLEditor\Toolbar_buttons
    7>  		-> ColorSelector.debug.js [1308 bytes (1.27734375kb)]
    7>  		-> ColorSelector.js [1308 bytes (1.27734375kb)]
    7>  JSBuild: Processing CommonButton.pre.js -> C:\AjaxSource\Server\AjaxControlToolkit\ScriptOutput\HTMLEditor\Toolbar_buttons
    7>  		-> CommonButton.debug.js [8531 bytes (8.3310546875kb)]
    7>  		-> CommonButton.js [8531 bytes (8.3310546875kb)]
    7>  JSBuild: Processing Copy.pre.js -> C:\AjaxSource\Server\AjaxControlToolkit\ScriptOutput\HTMLEditor\Toolbar_buttons
    7>  		-> Copy.debug.js [1022 bytes (0.998046875kb)]
    7>  		-> Copy.js [1022 bytes (0.998046875kb)]
    7>  JSBuild: Processing Cut.pre.js -> C:\AjaxSource\Server\AjaxControlToolkit\ScriptOutput\HTMLEditor\Toolbar_buttons
    7>  		-> Cut.debug.js [902 bytes (0.880859375kb)]
    7>  		-> Cut.js [902 bytes (0.880859375kb)]
    7>  JSBuild: Processing DecreaseIndent.pre.js -> C:\AjaxSource\Server\AjaxControlToolkit\ScriptOutput\HTMLEditor\Toolbar_buttons
    7>  		-> DecreaseIndent.debug.js [722 bytes (0.705078125kb)]
    7>  		-> DecreaseIndent.js [722 bytes (0.705078125kb)]
    7>  JSBuild: Processing DesignMode.pre.js -> C:\AjaxSource\Server\AjaxControlToolkit\ScriptOutput\HTMLEditor\Toolbar_buttons
    7>  		-> DesignMode.debug.js [491 bytes (0.4794921875kb)]
    7>  		-> DesignMode.js [491 bytes (0.4794921875kb)]
    7>  JSBuild: Processing DesignModeBoxButton.pre.js -> C:\AjaxSource\Server\AjaxControlToolkit\ScriptOutput\HTMLEditor\Toolbar_buttons
    7>  		-> DesignModeBoxButton.debug.js [1197 bytes (1.1689453125kb)]
    7>  		-> DesignModeBoxButton.js [1197 bytes (1.1689453125kb)]
    7>  JSBuild: Processing DesignModeImageButton.pre.js -> C:\AjaxSource\Server\AjaxControlToolkit\ScriptOutput\HTMLEditor\Toolbar_buttons
    7>  		-> DesignModeImageButton.debug.js [1212 bytes (1.18359375kb)]
    7>  		-> DesignModeImageButton.js [1212 bytes (1.18359375kb)]
    7>  JSBuild: Processing DesignModePopupImageButton.pre.js -> C:\AjaxSource\Server\AjaxControlToolkit\ScriptOutput\HTMLEditor\Toolbar_buttons
    7>  		-> DesignModePopupImageButton.debug.js [7656 bytes (7.4765625kb)]
    7>  		-> DesignModePopupImageButton.js [7656 bytes (7.4765625kb)]
    7>  JSBuild: Processing DesignModeSelectButton.pre.js -> C:\AjaxSource\Server\AjaxControlToolkit\ScriptOutput\HTMLEditor\Toolbar_buttons
    7>  		-> DesignModeSelectButton.debug.js [1151 bytes (1.1240234375kb)]
    7>  		-> DesignModeSelectButton.js [1151 bytes (1.1240234375kb)]
    7>  JSBuild: Processing EditorToggleButton.pre.js -> C:\AjaxSource\Server\AjaxControlToolkit\ScriptOutput\HTMLEditor\Toolbar_buttons
    7>  		-> EditorToggleButton.debug.js [865 bytes (0.8447265625kb)]
    7>  		-> EditorToggleButton.js [865 bytes (0.8447265625kb)]
    7>  JSBuild: Processing FixedBackColor.pre.js -> C:\AjaxSource\Server\AjaxControlToolkit\ScriptOutput\HTMLEditor\Toolbar_buttons
    7>  		-> FixedBackColor.debug.js [626 bytes (0.611328125kb)]
    7>  		-> FixedBackColor.js [626 bytes (0.611328125kb)]
    7>  JSBuild: Processing FixedColorButton.pre.js -> C:\AjaxSource\Server\AjaxControlToolkit\ScriptOutput\HTMLEditor\Toolbar_buttons
    7>  		-> FixedColorButton.debug.js [1958 bytes (1.912109375kb)]
    7>  		-> FixedColorButton.js [1958 bytes (1.912109375kb)]
    7>  JSBuild: Processing FixedForeColor.pre.js -> C:\AjaxSource\Server\AjaxControlToolkit\ScriptOutput\HTMLEditor\Toolbar_buttons
    7>  		-> FixedForeColor.debug.js [626 bytes (0.611328125kb)]
    7>  		-> FixedForeColor.js [626 bytes (0.611328125kb)]
    7>  JSBuild: Processing FontName.pre.js -> C:\AjaxSource\Server\AjaxControlToolkit\ScriptOutput\HTMLEditor\Toolbar_buttons
    7>  		-> FontName.debug.js [2513 bytes (2.4541015625kb)]
    7>  		-> FontName.js [2513 bytes (2.4541015625kb)]
    7>  JSBuild: Processing FontSize.pre.js -> C:\AjaxSource\Server\AjaxControlToolkit\ScriptOutput\HTMLEditor\Toolbar_buttons
    7>  		-> FontSize.debug.js [2750 bytes (2.685546875kb)]
    7>  		-> FontSize.js [2750 bytes (2.685546875kb)]
    7>  JSBuild: Processing ForeColor.pre.js -> C:\AjaxSource\Server\AjaxControlToolkit\ScriptOutput\HTMLEditor\Toolbar_buttons
    7>  		-> ForeColor.debug.js [858 bytes (0.837890625kb)]
    7>  		-> ForeColor.js [858 bytes (0.837890625kb)]
    7>  JSBuild: Processing ForeColorClear.pre.js -> C:\AjaxSource\Server\AjaxControlToolkit\ScriptOutput\HTMLEditor\Toolbar_buttons
    7>  		-> ForeColorClear.debug.js [735 bytes (0.7177734375kb)]
    7>  		-> ForeColorClear.js [735 bytes (0.7177734375kb)]
    7>  JSBuild: Processing ForeColorSelector.pre.js -> C:\AjaxSource\Server\AjaxControlToolkit\ScriptOutput\HTMLEditor\Toolbar_buttons
    7>  		-> ForeColorSelector.debug.js [916 bytes (0.89453125kb)]
    7>  		-> ForeColorSelector.js [916 bytes (0.89453125kb)]
    7>  JSBuild: Processing HorizontalSeparator.pre.js -> C:\AjaxSource\Server\AjaxControlToolkit\ScriptOutput\HTMLEditor\Toolbar_buttons
    7>  		-> HorizontalSeparator.debug.js [611 bytes (0.5966796875kb)]
    7>  		-> HorizontalSeparator.js [611 bytes (0.5966796875kb)]
    7>  JSBuild: Processing HtmlMode.pre.js -> C:\AjaxSource\Server\AjaxControlToolkit\ScriptOutput\HTMLEditor\Toolbar_buttons
    7>  		-> HtmlMode.debug.js [481 bytes (0.4697265625kb)]
    7>  		-> HtmlMode.js [481 bytes (0.4697265625kb)]
    7>  JSBuild: Processing ImageButton.pre.js -> C:\AjaxSource\Server\AjaxControlToolkit\ScriptOutput\HTMLEditor\Toolbar_buttons
    7>  		-> ImageButton.debug.js [4887 bytes (4.7724609375kb)]
    7>  		-> ImageButton.js [4887 bytes (4.7724609375kb)]
    7>  JSBuild: Processing IncreaseIndent.pre.js -> C:\AjaxSource\Server\AjaxControlToolkit\ScriptOutput\HTMLEditor\Toolbar_buttons
    7>  		-> IncreaseIndent.debug.js [721 bytes (0.7041015625kb)]
    7>  		-> IncreaseIndent.js [721 bytes (0.7041015625kb)]
    7>  JSBuild: Processing InsertHR.pre.js -> C:\AjaxSource\Server\AjaxControlToolkit\ScriptOutput\HTMLEditor\Toolbar_buttons
    7>  		-> InsertHR.debug.js [1383 bytes (1.3505859375kb)]
    7>  		-> InsertHR.js [1383 bytes (1.3505859375kb)]
    7>  JSBuild: Processing InsertLink.pre.js -> C:\AjaxSource\Server\AjaxControlToolkit\ScriptOutput\HTMLEditor\Toolbar_buttons
    7>  		-> InsertLink.debug.js [11001 bytes (10.7431640625kb)]
    7>  		-> InsertLink.js [11001 bytes (10.7431640625kb)]
    7>  JSBuild: Processing Italic.pre.js -> C:\AjaxSource\Server\AjaxControlToolkit\ScriptOutput\HTMLEditor\Toolbar_buttons
    7>  		-> Italic.debug.js [912 bytes (0.890625kb)]
    7>  		-> Italic.js [912 bytes (0.890625kb)]
    7>  JSBuild: Processing JustifyCenter.pre.js -> C:\AjaxSource\Server\AjaxControlToolkit\ScriptOutput\HTMLEditor\Toolbar_buttons
    7>  		-> JustifyCenter.debug.js [952 bytes (0.9296875kb)]
    7>  		-> JustifyCenter.js [952 bytes (0.9296875kb)]
    7>  JSBuild: Processing JustifyFull.pre.js -> C:\AjaxSource\Server\AjaxControlToolkit\ScriptOutput\HTMLEditor\Toolbar_buttons
    7>  		-> JustifyFull.debug.js [937 bytes (0.9150390625kb)]
    7>  		-> JustifyFull.js [937 bytes (0.9150390625kb)]
    7>  JSBuild: Processing JustifyLeft.pre.js -> C:\AjaxSource\Server\AjaxControlToolkit\ScriptOutput\HTMLEditor\Toolbar_buttons
    7>  		-> JustifyLeft.debug.js [934 bytes (0.912109375kb)]
    7>  		-> JustifyLeft.js [934 bytes (0.912109375kb)]
    7>  JSBuild: Processing JustifyRight.pre.js -> C:\AjaxSource\Server\AjaxControlToolkit\ScriptOutput\HTMLEditor\Toolbar_buttons
    7>  		-> JustifyRight.debug.js [943 bytes (0.9208984375kb)]
    7>  		-> JustifyRight.js [943 bytes (0.9208984375kb)]
    7>  JSBuild: Processing Ltr.pre.js -> C:\AjaxSource\Server\AjaxControlToolkit\ScriptOutput\HTMLEditor\Toolbar_buttons
    7>  		-> Ltr.debug.js [1439 bytes (1.4052734375kb)]
    7>  		-> Ltr.js [1439 bytes (1.4052734375kb)]
    7>  JSBuild: Processing MethodButton.pre.js -> C:\AjaxSource\Server\AjaxControlToolkit\ScriptOutput\HTMLEditor\Toolbar_buttons
    7>  		-> MethodButton.debug.js [512 bytes (0.5kb)]
    7>  		-> MethodButton.js [512 bytes (0.5kb)]
    7>  JSBuild: Processing ModeButton.pre.js -> C:\AjaxSource\Server\AjaxControlToolkit\ScriptOutput\HTMLEditor\Toolbar_buttons
    7>  		-> ModeButton.debug.js [1260 bytes (1.23046875kb)]
    7>  		-> ModeButton.js [1260 bytes (1.23046875kb)]
    7>  JSBuild: Processing OkCancelPopupButton.pre.js -> C:\AjaxSource\Server\AjaxControlToolkit\ScriptOutput\HTMLEditor\Toolbar_buttons
    7>  		-> OkCancelPopupButton.debug.js [2830 bytes (2.763671875kb)]
    7>  		-> OkCancelPopupButton.js [2830 bytes (2.763671875kb)]
    7>  JSBuild: Processing OrderedList.pre.js -> C:\AjaxSource\Server\AjaxControlToolkit\ScriptOutput\HTMLEditor\Toolbar_buttons
    7>  		-> OrderedList.debug.js [714 bytes (0.697265625kb)]
    7>  		-> OrderedList.js [714 bytes (0.697265625kb)]
    7>  JSBuild: Processing Paragraph.pre.js -> C:\AjaxSource\Server\AjaxControlToolkit\ScriptOutput\HTMLEditor\Toolbar_buttons
    7>  		-> Paragraph.debug.js [914 bytes (0.892578125kb)]
    7>  		-> Paragraph.js [914 bytes (0.892578125kb)]
    7>  JSBuild: Processing Paste.pre.js -> C:\AjaxSource\Server\AjaxControlToolkit\ScriptOutput\HTMLEditor\Toolbar_buttons
    7>  		-> Paste.debug.js [1444 bytes (1.41015625kb)]
    7>  		-> Paste.js [1444 bytes (1.41015625kb)]
    7>  JSBuild: Processing PasteText.pre.js -> C:\AjaxSource\Server\AjaxControlToolkit\ScriptOutput\HTMLEditor\Toolbar_buttons
    7>  		-> PasteText.debug.js [1563 bytes (1.5263671875kb)]
    7>  		-> PasteText.js [1563 bytes (1.5263671875kb)]
    7>  JSBuild: Processing PasteWord.pre.js -> C:\AjaxSource\Server\AjaxControlToolkit\ScriptOutput\HTMLEditor\Toolbar_buttons
    7>  		-> PasteWord.debug.js [1581 bytes (1.5439453125kb)]
    7>  		-> PasteWord.js [1581 bytes (1.5439453125kb)]
    7>  JSBuild: Processing PreviewMode.pre.js -> C:\AjaxSource\Server\AjaxControlToolkit\ScriptOutput\HTMLEditor\Toolbar_buttons
    7>  		-> PreviewMode.debug.js [496 bytes (0.484375kb)]
    7>  		-> PreviewMode.js [496 bytes (0.484375kb)]
    7>  JSBuild: Processing Redo.pre.js -> C:\AjaxSource\Server\AjaxControlToolkit\ScriptOutput\HTMLEditor\Toolbar_buttons
    7>  		-> Redo.debug.js [645 bytes (0.6298828125kb)]
    7>  		-> Redo.js [645 bytes (0.6298828125kb)]
    7>  JSBuild: Processing RemoveAlignment.pre.js -> C:\AjaxSource\Server\AjaxControlToolkit\ScriptOutput\HTMLEditor\Toolbar_buttons
    7>  		-> RemoveAlignment.debug.js [1162 bytes (1.134765625kb)]
    7>  		-> RemoveAlignment.js [1162 bytes (1.134765625kb)]
    7>  JSBuild: Processing RemoveLink.pre.js -> C:\AjaxSource\Server\AjaxControlToolkit\ScriptOutput\HTMLEditor\Toolbar_buttons
    7>  		-> RemoveLink.debug.js [1619 bytes (1.5810546875kb)]
    7>  		-> RemoveLink.js [1619 bytes (1.5810546875kb)]
    7>  JSBuild: Processing RemoveStyles.pre.js -> C:\AjaxSource\Server\AjaxControlToolkit\ScriptOutput\HTMLEditor\Toolbar_buttons
    7>  		-> RemoveStyles.debug.js [18280 bytes (17.8515625kb)]
    7>  		-> RemoveStyles.js [18280 bytes (17.8515625kb)]
    7>  JSBuild: Processing Rtl.pre.js -> C:\AjaxSource\Server\AjaxControlToolkit\ScriptOutput\HTMLEditor\Toolbar_buttons
    7>  		-> Rtl.debug.js [1436 bytes (1.40234375kb)]
    7>  		-> Rtl.js [1436 bytes (1.40234375kb)]
    7>  JSBuild: Processing SelectButton.pre.js -> C:\AjaxSource\Server\AjaxControlToolkit\ScriptOutput\HTMLEditor\Toolbar_buttons
    7>  		-> SelectButton.debug.js [2396 bytes (2.33984375kb)]
    7>  		-> SelectButton.js [2396 bytes (2.33984375kb)]
    7>  JSBuild: Processing Selector.pre.js -> C:\AjaxSource\Server\AjaxControlToolkit\ScriptOutput\HTMLEditor\Toolbar_buttons
    7>  		-> Selector.debug.js [497 bytes (0.4853515625kb)]
    7>  		-> Selector.js [497 bytes (0.4853515625kb)]
    7>  JSBuild: Processing StrikeThrough.pre.js -> C:\AjaxSource\Server\AjaxControlToolkit\ScriptOutput\HTMLEditor\Toolbar_buttons
    7>  		-> StrikeThrough.debug.js [975 bytes (0.9521484375kb)]
    7>  		-> StrikeThrough.js [975 bytes (0.9521484375kb)]
    7>  JSBuild: Processing SubScript.pre.js -> C:\AjaxSource\Server\AjaxControlToolkit\ScriptOutput\HTMLEditor\Toolbar_buttons
    7>  		-> SubScript.debug.js [939 bytes (0.9169921875kb)]
    7>  		-> SubScript.js [939 bytes (0.9169921875kb)]
    7>  JSBuild: Processing SuperScript.pre.js -> C:\AjaxSource\Server\AjaxControlToolkit\ScriptOutput\HTMLEditor\Toolbar_buttons
    7>  		-> SuperScript.debug.js [957 bytes (0.9345703125kb)]
    7>  		-> SuperScript.js [957 bytes (0.9345703125kb)]
    7>  JSBuild: Processing Underline.pre.js -> C:\AjaxSource\Server\AjaxControlToolkit\ScriptOutput\HTMLEditor\Toolbar_buttons
    7>  		-> Underline.debug.js [941 bytes (0.9189453125kb)]
    7>  		-> Underline.js [941 bytes (0.9189453125kb)]
    7>  JSBuild: Processing Undo.pre.js -> C:\AjaxSource\Server\AjaxControlToolkit\ScriptOutput\HTMLEditor\Toolbar_buttons
    7>  		-> Undo.debug.js [645 bytes (0.6298828125kb)]
    7>  		-> Undo.js [645 bytes (0.6298828125kb)]
    7>  JSBuild: Processing LineChart.pre.js -> C:\AjaxSource\Server\AjaxControlToolkit\ScriptOutput\LineChart
    7>  		-> LineChart.debug.js [29676 bytes (28.98046875kb)]
    7>  		-> LineChart.js [29676 bytes (28.98046875kb)]
    7>  JSBuild: Processing NoBotBehavior.pre.js -> C:\AjaxSource\Server\AjaxControlToolkit\ScriptOutput\NoBot
    7>  		-> NoBotBehavior.debug.js [1847 bytes (1.8037109375kb)]
    7>  		-> NoBotBehavior.js [1847 bytes (1.8037109375kb)]
    7>  JSBuild: Processing PieChart.pre.js -> C:\AjaxSource\Server\AjaxControlToolkit\ScriptOutput\PieChart
    7>  		-> PieChart.debug.js [11131 bytes (10.8701171875kb)]
    7>  		-> PieChart.js [11131 bytes (10.8701171875kb)]
    7>  JSBuild: Processing DraggableListItemBehavior.pre.js -> C:\AjaxSource\Server\AjaxControlToolkit\ScriptOutput\ReorderList
    7>  		-> DraggableListItemBehavior.debug.js [4929 bytes (4.8134765625kb)]
    7>  		-> DraggableListItemBehavior.js [4929 bytes (4.8134765625kb)]
    7>  JSBuild: Processing DropWatcherBehavior.pre.js -> C:\AjaxSource\Server\AjaxControlToolkit\ScriptOutput\ReorderList
    7>  		-> DropWatcherBehavior.debug.js [27853 bytes (27.2001953125kb)]
    7>  		-> DropWatcherBehavior.js [27853 bytes (27.2001953125kb)]
    7>  JSBuild: Processing SliderBehavior_resource.pre.js -> C:\AjaxSource\Server\AjaxControlToolkit\ScriptOutput\Slider
    7>  		-> SliderBehavior_resource.debug.js [30835 bytes (30.1123046875kb)]
    7>  		-> SliderBehavior_resource.js [30835 bytes (30.1123046875kb)]
    7>C:\Windows\Microsoft.NET\Framework\v4.0.30319\Microsoft.Common.targets(1578,5): warning MSB3245: Could not resolve this reference. Could not locate the assembly "Microsoft.WindowsAzure.Storage, Version=2.0.0.0, Culture=neutral, PublicKeyToken=31bf3856ad364e35, processorArchitecture=MSIL". Check to make sure the assembly exists on disk. If this reference is required by your code, you may get compilation errors.
    7>C:\AjaxSource\Server\AjaxControlToolkit\AjaxFileUpload\Helpers\AjaxFileUploadAzureHelper.cs(7,17,7,29): error CS0234: The type or namespace name 'WindowsAzure' does not exist in the namespace 'Microsoft' (are you missing an assembly reference?)
    7>C:\AjaxSource\Server\AjaxControlToolkit\AjaxFileUpload\Helpers\AjaxFileUploadAzureHelper.cs(8,17,8,29): error CS0234: The type or namespace name 'WindowsAzure' does not exist in the namespace 'Microsoft' (are you missing an assembly reference?)
    7>C:\AjaxSource\Server\AjaxControlToolkit\AjaxFileUpload\Helpers\AjaxFileUploadAzureHelper.cs(200,24,200,39): error CS0246: The type or namespace name 'CloudBlobClient' could not be found (are you missing a using directive or an assembly reference?)
    8>------ Build started: Project: C:\...\AjaxControlToolkitSampleSite\, Configuration: Debug Any CPU ------
    8>Validating Web Site
    9>------ Build started: Project: UnitTests, Configuration: Debug Any CPU ------
    10>------ Build started: Project: AjaxControlToolkit.BackwardCompatibilityTests, Configuration: Debug Any CPU ------
    11>------ Build started: Project: AjaxControlToolkit.Tests, Configuration: Debug Any CPU ------
    9>CSC : error CS0006: Metadata file 'C:\AjaxSource\Server\AjaxControlToolkit\bin\NET45\Debug\AjaxControlToolkit.dll' could not be found
    10>CSC : error CS0006: Metadata file 'C:\AjaxSource\Server\AjaxControlToolkit\bin\NET45\Debug\AjaxControlToolkit.dll' could not be found
    11>CSC : error CS0006: Metadata file 'C:\AjaxSource\Server\AjaxControlToolkit\bin\NET45\Debug\AjaxControlToolkit.dll' could not be found
    8>Building directory '/AjaxControlToolkitSampleSite/App_Code/'.
    8>
    8>C:\AjaxSource\SampleWebSites\AjaxControlToolkitSampleSite\App_Code\HTMLEditor.CustomButtonsAndPopups.cs(25,37): error CS0234: The type or namespace name 'ToolbarButton' does not exist in the namespace 'AjaxControlToolkit.HTMLEditor' (are you missing an assembly reference?)
    8>C:\AjaxSource\SampleWebSites\AjaxControlToolkitSampleSite\App_Code\HTMLEditor.CustomButtonsAndPopups.cs(35,31): error CS0246: The type or namespace name 'DesignModePopupImageButton' could not be found (are you missing a using directive or an assembly reference?)
    8>C:\AjaxSource\SampleWebSites\AjaxControlToolkitSampleSite\App_Code\HTMLEditor.CustomButtonsAndPopups.cs(98,31): error CS0246: The type or namespace name 'MethodButton' could not be found (are you missing a using directive or an assembly reference?)
    8>C:\AjaxSource\SampleWebSites\AjaxControlToolkitSampleSite\App_Code\HTMLEditor.CustomButtonsAndPopups.cs(132,38): error CS0246: The type or namespace name 'Popups' could not be found (are you missing a using directive or an assembly reference?)
    8>C:\AjaxSource\SampleWebSites\AjaxControlToolkitSampleSite\App_Code\HTMLEditor.Samples.cs(5,52): error CS0234: The type or namespace name 'Editor' does not exist in the namespace 'AjaxControlToolkit.HTMLEditor' (are you missing an assembly reference?)
    8>C:\AjaxSource\SampleWebSites\AjaxControlToolkitSampleSite\App_Code\HTMLEditor.Samples.cs(115,60): error CS0234: The type or namespace name 'Editor' does not exist in the namespace 'AjaxControlToolkit.HTMLEditor' (are you missing an assembly reference?)
    8>C:\AjaxSource\SampleWebSites\AjaxControlToolkitSampleSite\App_Code\HTMLEditor.Samples.cs(122,67): error CS0234: The type or namespace name 'Editor' does not exist in the namespace 'AjaxControlToolkit.HTMLEditor' (are you missing an assembly reference?)
    8>C:\AjaxSource\SampleWebSites\AjaxControlToolkitSampleSite\App_Code\HTMLEditor.Samples.cs(133,74): error CS0234: The type or namespace name 'Editor' does not exist in the namespace 'AjaxControlToolkit.HTMLEditor' (are you missing an assembly reference?)
    8>C:\AjaxSource\SampleWebSites\AjaxControlToolkitSampleSite\App_Code\CarsService.cs(73,31): error CS0234: The type or namespace name 'CascadingDropDownNameValue' does not exist in the namespace 'AjaxControlToolkit' (are you missing an assembly reference?)
    8>C:\AjaxSource\SampleWebSites\AjaxControlToolkitSampleSite\App_Code\HTMLEditor.CustomButtonsAndPopups.cs(33,6): error CS0246: The type or namespace name 'RequiredScript' could not be found (are you missing a using directive or an assembly reference?)
    8>C:\AjaxSource\SampleWebSites\AjaxControlToolkitSampleSite\App_Code\HTMLEditor.CustomButtonsAndPopups.cs(33,6): error CS0246: The type or namespace name 'RequiredScriptAttribute' could not be found (are you missing a using directive or an assembly reference?)
    8>C:\AjaxSource\SampleWebSites\AjaxControlToolkitSampleSite\App_Code\HTMLEditor.CustomButtonsAndPopups.cs(96,6): error CS0246: The type or namespace name 'RequiredScript' could not be found (are you missing a using directive or an assembly reference?)
    8>C:\AjaxSource\SampleWebSites\AjaxControlToolkitSampleSite\App_Code\HTMLEditor.CustomButtonsAndPopups.cs(96,6): error CS0246: The type or namespace name 'RequiredScriptAttribute' could not be found (are you missing a using directive or an assembly reference?)
    8>C:\AjaxSource\SampleWebSites\AjaxControlToolkitSampleSite\App_Code\HTMLEditor.CustomButtonsAndPopups.cs(130,6): error CS0246: The type or namespace name 'RequiredScript' could not be found (are you missing a using directive or an assembly reference?)
    8>C:\AjaxSource\SampleWebSites\AjaxControlToolkitSampleSite\App_Code\HTMLEditor.CustomButtonsAndPopups.cs(130,6): error CS0246: The type or namespace name 'RequiredScriptAttribute' could not be found (are you missing a using directive or an assembly reference?)
    8>Validation Complete
    ========== Build: 3 succeeded, 5 failed, 0 up-to-date, 3 skipped ==========

    I really hope someone can point me in the right direction, I am severely held up with this and have executives breathing down my neck.  Deadline quickly approaching and I can't republish our site without getting past this point.  Any help would be greatly appreciated :)

    Monday, August 26, 2013 11:56 AM
  • User-417640953 posted

    Hello,

    Welcome to feedback. Based on your build message, I would like to suggest you

    download and set up Windows Azure SDK first.

    http://www.windowsazure.com/en-us/downloads/?sdk=net

     

    Hope it helps, thanks.

     

    Best Regards!

     

    • Marked as answer by Anonymous Thursday, October 7, 2021 12:00 AM
    Monday, August 26, 2013 9:12 PM
  • User-1175241094 posted

    Yes!  That was it.  The entire thing compiled without a hitch.  You saved me a lot of frustration, thank you.  If your ever in Central Jersey drinks are on me.

    Monday, August 26, 2013 9:48 PM
  • User1599962511 posted

    God almighty, I wish that was it for me.  I know this is an old thread, but I'm desperate.  Can you explain how you installed the Azure SDK after you downloaded it?  I ran the exe file and it seemed like everyhing installed fine, but I still get the same errors you listed above.  I tried adding references to any Azure items I could find in VS2012, but still nothing improved.

    Thanks!

    Dave

    Wednesday, December 11, 2013 8:43 PM