locked
error MSB6006: "cmd.exe" exited with code 3. RRS feed

  • Question

  • Hi,

    I'm using a VS project which depends on Qt but when building the project this error is still appearing "

    error MSB6006: "cmd.exe" exited with code 3.

    . I've checked this two questions:

    http://social.msdn.microsoft.com/Forums/en-US/msbuild/thread/22da875d-c86c-41ac-9076-9b4ed37114bf/  

    and http://social.msdn.microsoft.com/Forums/en-US/msbuild/thread/5b0be7be-1b6e-44c2-91ca-b5a9a55a2c41/

    but couldn't find an answer so if anyone could please help me as this is fairly important and urgent for me?

    Many Thanks in advance for your kind assistance

    • Moved by Ego Jiang Tuesday, March 26, 2013 2:38 AM
    Saturday, March 16, 2013 2:49 PM

All replies

  • Hi,

    Please post more detail log here.

    In the Visual Studio, go to Tools->Options->Project and Solutions->Build and Run section. You have a drop down box for increasing build verbosity that will help you reproduce what command is causing the problem.

    With MSbuild on the command line you can use /verbosity: diag.

    Best regards,


    Ego [MSFT]
    MSDN Community Support | Feedback to us
    Develop and promote your apps in Windows Store
    Please remember to mark the replies as answers if they help and unmark them if they provide no help.

    Monday, March 18, 2013 6:52 AM
  • Hi Ego,

    Thanks for your reply.

    Kindly find the below logfile, please try to assist me as this is fairly very important and urgent for me.

    Many Thanks for your kind assistance and support

    logfile:

    Build started 13/03/2013 5:51:08 PM.
         1>Project "D:\hussein\KinectQtDataAcquisition\KinectQtDataAcquisition\QtDataAcquisition.vcxproj" on node 2 (build target(s)).
         1>Building with tools version "4.0".
         1>Target "_CheckForInvalidConfigurationAndPlatform" in file "C:\Windows\Microsoft.NET\Framework\v4.0.30319\Microsoft.Common.Targets" from project "D:\hussein\KinectQtDataAcquisition\KinectQtDataAcquisition\QtDataAcquisition.vcxproj" (entry point):
           Task "Error" skipped, due to false condition; ( '$(_InvalidConfigurationError)' == 'true' ) was evaluated as ( '' == 'true' ).
           Task "Warning" skipped, due to false condition; ( '$(_InvalidConfigurationWarning)' == 'true' ) was evaluated as ( '' == 'true' ).
           Using "Message" task from assembly "Microsoft.Build.Tasks.v4.0, Version=4.0.0.0, Culture=neutral, PublicKeyToken=b03f5f7f11d50a3a".
           Task "Message"
             Configuration=Debug
           Done executing task "Message".
           Task "Message"
             Platform=Win32
           Done executing task "Message".
           Task "Error" skipped, due to false condition; ('$(OutDir)' != '' and !HasTrailingSlash('$(OutDir)')) was evaluated as ('D:\hussein\KinectQtDataAcquisition\KinectQtDataAcquisition\' != '' and !HasTrailingSlash('D:\hussein\KinectQtDataAcquisition\KinectQtDataAcquisition\')).
           Task "Error" skipped, due to false condition; ('$(BaseIntermediateOutputPath)' != '' and !HasTrailingSlash('$(BaseIntermediateOutputPath)')) was evaluated as ('obj\' != '' and !HasTrailingSlash('obj\')).
           Task "Error" skipped, due to false condition; ('$(IntermediateOutputPath)' != '' and !HasTrailingSlash('$(IntermediateOutputPath)')) was evaluated as ('Debug\' != '' and !HasTrailingSlash('Debug\')).
         1>Done building target "_CheckForInvalidConfigurationAndPlatform" in project "QtDataAcquisition.vcxproj".
         1>Target "_DetermineManagedStateFromCL" in file "C:\Program Files\MSBuild\Microsoft.Cpp\v4.0\Microsoft.CppBuild.targets" from project "D:\hussein\KinectQtDataAcquisition\KinectQtDataAcquisition\QtDataAcquisition.vcxproj" (target "Build" depends on it):
         1>Done building target "_DetermineManagedStateFromCL" in project "QtDataAcquisition.vcxproj".
         1>Target "_PrepareForBuild" in file "C:\Program Files\MSBuild\Microsoft.Cpp\v4.0\Microsoft.BuildSteps.Targets" from project "D:\hussein\KinectQtDataAcquisition\KinectQtDataAcquisition\QtDataAcquisition.vcxproj" (target "Build" depends on it):
         1>Done building target "_PrepareForBuild" in project "QtDataAcquisition.vcxproj".
         1>Target "SetBuildDefaultEnvironmentVariables" in file "C:\Program Files\MSBuild\Microsoft.Cpp\v4.0\Microsoft.Cpp.targets" from project "D:\hussein\KinectQtDataAcquisition\KinectQtDataAcquisition\QtDataAcquisition.vcxproj" (target "Build" depends on it):
           Using "SetEnv" task from assembly "Microsoft.Build.CppTasks.Common, Version=4.0.0.0, Culture=neutral, PublicKeyToken=b03f5f7f11d50a3a".
           Task "SetEnv"
             PATH=C:\Program Files\Microsoft Visual Studio 10.0\VC\bin;C:\Program Files\Microsoft SDKs\Windows\v7.0A\bin\NETFX 4.0 Tools;C:\Program Files\Microsoft SDKs\Windows\v7.0A\bin;C:\Program Files\Microsoft Visual Studio 10.0\Common7\Tools\bin;C:\Program Files\Microsoft Visual Studio 10.0\Common7\tools;C:\Program Files\Microsoft Visual Studio 10.0\Common7\ide;C:\Program Files\HTML Help Workshop;C:\Program Files\Microsoft SDKs\Windows\v7.0A\\bin;C:\Windows\Microsoft.NET\Framework\v4.0.30319\;C:\Program Files\Microsoft Visual Studio 10.0\;C:\Windows\SysWow64;;.;C:\Program Files\Novint\Falcon\HDAL\bin;.;C:\Windows\system32;C:\Windows;C:\Windows\System32\Wbem;C:\Windows\System32\WindowsPowerShell\v1.0\;c:\Program Files\Microsoft SQL Server\90\Tools\binn\;c:\Program Files\Microsoft SQL Server\100\Tools\Binn\;c:\Program Files\Microsoft SQL Server\100\DTS\Binn\;C:\Program Files\Common Files\Autodesk Shared\;C:\Program Files\backburner 2\;C:\Program Files\PrimeSense\NITE\bin;C:\Program Files\OpenNI\Bin;C:\Program Files\Prime Sense\NITE\Bin;
           Done executing task "SetEnv".
           Task "SetEnv" skipped, due to false condition; ('$(_IsNativeEnvironment)' == 'true') was evaluated as ('' == 'true').
           Task "SetEnv"
             LIB=D:\hussein\OpenCV2.3\opencv\common\tbb\lib\ia32\vc10;D:\hussein\OpenCV2.3\build\x86\vc10\lib;C:\Program Files\OpenNI\Lib;C:\Program Files\Microsoft Visual Studio 10.0\VC\lib;C:\Program Files\Microsoft Visual Studio 10.0\VC\atlmfc\lib;C:\Program Files\Microsoft SDKs\Windows\v7.0A\lib;C:\Program Files\Microsoft SDKs\Windows\v7.0A\\lib
           Done executing task "SetEnv".
           Task "SetEnv"
             LIBPATH=C:\Program Files\Microsoft Visual Studio 10.0\VC\atlmfc\lib;C:\Program Files\Microsoft Visual Studio 10.0\VC\lib
           Done executing task "SetEnv".
           Task "SetEnv"
             INCLUDE=D:\hussein\OpenCV2.3\opencv\common\tbb\lib\ia32\vc10;D:\hussein\OpenCV2.3\build\include;C:\Program Files\OpenNI\Include;C:\Program Files\Microsoft Visual Studio 10.0\VC\include;C:\Program Files\Microsoft Visual Studio 10.0\VC\atlmfc\include;C:\Program Files\Microsoft SDKs\Windows\v7.0A\include;C:\Program Files\Microsoft SDKs\Windows\v7.0A\\include;
           Done executing task "SetEnv".
         1>Done building target "SetBuildDefaultEnvironmentVariables" in project "QtDataAcquisition.vcxproj".
           Target "SetUserMacroEnvironmentVariables" skipped, due to false condition; ('@(BuildMacro)' != '') was evaluated as ('' != '').
         1>Target "BeforeResolveReferences" in file "C:\Windows\Microsoft.NET\Framework\v4.0.30319\Microsoft.Common.Targets" from project "D:\hussein\KinectQtDataAcquisition\KinectQtDataAcquisition\QtDataAcquisition.vcxproj" (target "ResolveReferences" depends on it):
         1>Done building target "BeforeResolveReferences" in project "QtDataAcquisition.vcxproj".
           Target "AssignProjectConfiguration" skipped, due to false condition; ('@(ProjectReference)'!='') was evaluated as (''!='').
           Target "AssignProjectConfiguration" skipped, due to false condition; ('@(ProjectReference)'!='') was evaluated as (''!='').
         1>Target "_SplitProjectReferencesByFileExistence" in file "C:\Windows\Microsoft.NET\Framework\v4.0.30319\Microsoft.Common.Targets" from project "D:\hussein\KinectQtDataAcquisition\KinectQtDataAcquisition\QtDataAcquisition.vcxproj" (target "ResolveProjectReferences" depends on it):
           Task "ResolveNonMSBuildProjectOutput" skipped, due to false condition; ('$(BuildingInsideVisualStudio)'=='true' and '@(ProjectReferenceWithConfiguration)'!='') was evaluated as ('true'=='true' and ''!='').
         1>Done building target "_SplitProjectReferencesByFileExistence" in project "QtDataAcquisition.vcxproj".
           Target "_RemoveNameMetadataFromProjectReferenceItems" skipped, due to false condition; ('@(ProjectReference)'!='') was evaluated as (''!='').
         1>Target "ResolveProjectReferences" in file "C:\Windows\Microsoft.NET\Framework\v4.0.30319\Microsoft.Common.Targets" from project "D:\hussein\KinectQtDataAcquisition\KinectQtDataAcquisition\QtDataAcquisition.vcxproj" (target "ResolveReferences" depends on it):
           Task "MSBuild" skipped, due to false condition; ('%(_MSBuildProjectReferenceExistent.BuildReference)' == 'true' and '@(ProjectReferenceWithConfiguration)' != '' and ('$(BuildingInsideVisualStudio)' == 'true' or '$(BuildProjectReferences)' != 'true') and '@(_MSBuildProjectReferenceExistent)' != '') was evaluated as ('' == 'true' and '' != '' and ('true' == 'true' or 'true' != 'true') and '' != '').
           Task "MSBuild" skipped, due to false condition; ('%(_MSBuildProjectReferenceExistent.BuildReference)' == 'true' and '@(ProjectReferenceWithConfiguration)' != '' and '$(BuildingInsideVisualStudio)' != 'true' and '$(BuildProjectReferences)' == 'true' and '@(_MSBuildProjectReferenceExistent)' != '') was evaluated as ('' == 'true' and '' != '' and 'true' != 'true' and 'true' == 'true' and '' != '').
           Task "MSBuild" skipped, due to false condition; ('%(_MSBuildProjectReferenceExistent.BuildReference)' == 'true' and '@(ProjectReferenceWithConfiguration)' != '' and '$(BuildingProject)' == 'true' and '@(_MSBuildProjectReferenceExistent)' != '') was evaluated as ('' == 'true' and '' != '' and 'true' == 'true' and '' != '').
           Task "Warning" skipped, due to false condition; ('@(ProjectReferenceWithConfiguration)' != '' and '@(_MSBuildProjectReferenceNonexistent)' != '') was evaluated as ('' != '' and '' != '').
         1>Done building target "ResolveProjectReferences" in project "QtDataAcquisition.vcxproj".
           Target "ResolveNativeReferences" skipped, due to false condition; ('@(NativeReference)'!='') was evaluated as (''!='').
           Target "ResolveAssemblyReferences" skipped, due to false condition; ('@(Reference)'!='' or '@(_ResolvedProjectReferencePaths)'!='' or '@(_ExplicitReference)' != '') was evaluated as (''!='' or ''!='' or '' != '').
           Target "ResolveComReferences" skipped, due to false condition; ('@(COMReference)'!='' or '@(COMFileReference)'!='') was evaluated as (''!='' or ''!='').
         1>Target "AfterResolveReferences" in file "C:\Windows\Microsoft.NET\Framework\v4.0.30319\Microsoft.Common.Targets" from project "D:\hussein\KinectQtDataAcquisition\KinectQtDataAcquisition\QtDataAcquisition.vcxproj" (target "ResolveReferences" depends on it):
         1>Done building target "AfterResolveReferences" in project "QtDataAcquisition.vcxproj".
           Target "ResolveTestReferences" skipped, due to false condition; ('@(Shadow)'!='') was evaluated as (''!='').
         1>Target "ResolveReferences" in file "C:\Windows\Microsoft.NET\Framework\v4.0.30319\Microsoft.Common.Targets" from project "D:\hussein\KinectQtDataAcquisition\KinectQtDataAcquisition\QtDataAcquisition.vcxproj" (target "Build" depends on it):
         1>Done building target "ResolveReferences" in project "QtDataAcquisition.vcxproj".
         1>Target "PlatformPrepareForBuild" in file "C:\Program Files\MSBuild\Microsoft.Cpp\v4.0\Platforms\Win32\Microsoft.Cpp.Win32.Targets" from project "D:\hussein\KinectQtDataAcquisition\KinectQtDataAcquisition\QtDataAcquisition.vcxproj" (target "PrepareForBuild" depends on it):
           Task "VCMessage" skipped, due to false condition; (!(exists('$(VCTargetsPath)\Platforms\Win32\PlatformToolsets\$(PlatformToolset)\Microsoft.Cpp.Win32.$(PlatformToolset).targets'))) was evaluated as (!(exists('C:\Program Files\MSBuild\Microsoft.Cpp\v4.0\\Platforms\Win32\PlatformToolsets\v100\Microsoft.Cpp.Win32.v100.targets'))).
         1>Done building target "PlatformPrepareForBuild" in project "QtDataAcquisition.vcxproj".
         1>Target "GetFrameworkPaths" in file "C:\Windows\Microsoft.NET\Framework\v4.0.30319\Microsoft.NETFramework.targets" from project "D:\hussein\KinectQtDataAcquisition\KinectQtDataAcquisition\QtDataAcquisition.vcxproj" (target "PrepareForBuild" depends on it):
         1>Done building target "GetFrameworkPaths" in project "QtDataAcquisition.vcxproj".
           Target "GetWinFXPath" skipped, due to false condition; (('@(Page)' != '' or '@(ApplicationDefinition)' != '' or '@(Resource)' != '') and ('$(GetWinFXNativePath)' != '' or '$(GetWinFXWoWPath)' != '' )) was evaluated as (('' != '' or '' != '' or '' != '') and ('' != '' or '' != '' )).
         1>Target "GetReferenceAssemblyPaths" in file "C:\Windows\Microsoft.NET\Framework\v4.0.30319\Microsoft.Common.Targets" from project "D:\hussein\KinectQtDataAcquisition\KinectQtDataAcquisition\QtDataAcquisition.vcxproj" (target "PrepareForBuild" depends on it):
           Task "GetReferenceAssemblyPaths" skipped, due to false condition; ('$(TargetFrameworkMoniker)' != '' and ('$(_TargetFrameworkDirectories)' == '' or '$(_FullFrameworkReferenceAssemblyPaths)' == '')) was evaluated as ('.NETFramework,Version=v4.0' != '' and ('C:\Program Files\Reference Assemblies\Microsoft\Framework\.NETFramework\v4.0' == '' or 'C:\Program Files\Reference Assemblies\Microsoft\Framework\.NETFramework\v4.0' == '')).
         1>Done building target "GetReferenceAssemblyPaths" in project "QtDataAcquisition.vcxproj".
         1>Target "PrepareForBuild" in file "C:\Program Files\MSBuild\Microsoft.Cpp\v4.0\Microsoft.CppBuild.targets" from project "D:\hussein\KinectQtDataAcquisition\KinectQtDataAcquisition\QtDataAcquisition.vcxproj" (target "Build" depends on it):
           Task "VCMessage" skipped, due to false condition; ('$(DesignTimeBuild)'!='true' and '$(ConfigurationPlatformExists)' != 'true') was evaluated as (''!='true' and 'true' != 'true').
           Using "MakeDir" task from assembly "Microsoft.Build.Tasks.v4.0, Version=4.0.0.0, Culture=neutral, PublicKeyToken=b03f5f7f11d50a3a".
           Task "MakeDir"
           Done executing task "MakeDir".
           Task "VCMessage" skipped, due to false condition; ('$(DesignTimeBuild)'!='true' and '$(VCInstallDir)'=='' and '$(UseEnv)' != 'true' and ($(TargetFrameworkVersion)=='v3.5' or $(TargetFrameworkVersion)=='v3.0' or $(TargetFrameworkVersion)=='v2.0' )) was evaluated as (''!='true' and 'C:\Program Files\Microsoft Visual Studio 10.0\VC\'=='' and '' != 'true' and (v4.0=='v3.5' or v4.0=='v3.0' or v4.0=='v2.0' )).
           Task "VCMessage" skipped, due to false condition; ('$(DesignTimeBuild)'!='true' and '$(VCInstallDir)'=='' and '$(UseEnv)' != 'true' and '$(PlatformToolset)'=='v90') was evaluated as (''!='true' and 'C:\Program Files\Microsoft Visual Studio 10.0\VC\'=='' and '' != 'true' and 'v100'=='v90').
           Task "VCMessage" skipped, due to false condition; ('$(VCInstallDir)'=='' and '$(UseEnv)' != 'true') was evaluated as ('C:\Program Files\Microsoft Visual Studio 10.0\VC\'=='' and '' != 'true').
           Task "VCMessage" skipped, due to false condition; ('$(WindowsSDKDir)'=='' and '$(UseEnv)' != 'true') was evaluated as ('C:\Program Files\Microsoft SDKs\Windows\v7.0A\'=='' and '' != 'true').
           Task "VCMessage" skipped, due to false condition; ('$(IntDirTrailingSlashWarning)'=='true') was evaluated as (''=='true').
           Task "VCMessage" skipped, due to false condition; ('$(OutDirTrailingSlashWarning)'=='true') was evaluated as (''=='true').
           Task "MakeDir"
           Done executing task "MakeDir".
         1>Done building target "PrepareForBuild" in project "QtDataAcquisition.vcxproj".
           Target "PrepareForBuild" skipped. Previously built successfully.
         1>Target "InitializeBuildStatus" in file "C:\Program Files\MSBuild\Microsoft.Cpp\v4.0\Microsoft.CppBuild.targets" from project "D:\hussein\KinectQtDataAcquisition\KinectQtDataAcquisition\QtDataAcquisition.vcxproj" (target "Build" depends on it):
           Using "ReadLinesFromFile" task from assembly "Microsoft.Build.Tasks.v4.0, Version=4.0.0.0, Culture=neutral, PublicKeyToken=b03f5f7f11d50a3a".
           Task "ReadLinesFromFile"
           Done executing task "ReadLinesFromFile".
           Using "WriteLinesToFile" task from assembly "Microsoft.Build.Tasks.v4.0, Version=4.0.0.0, Culture=neutral, PublicKeyToken=b03f5f7f11d50a3a".
           Task "WriteLinesToFile"
           Done executing task "WriteLinesToFile".
           Using "Touch" task from assembly "Microsoft.Build.Tasks.v4.0, Version=4.0.0.0, Culture=neutral, PublicKeyToken=b03f5f7f11d50a3a".
           Task "Touch"
             Touching "Debug\QtDataAcquisition.unsuccessfulbuild".
           Done executing task "Touch".
         1>Done building target "InitializeBuildStatus" in project "QtDataAcquisition.vcxproj".
           Target "AssignProjectConfiguration" skipped, due to false condition; ('@(ProjectReference)'!='') was evaluated as (''!='').
           Target "_SplitProjectReferencesByFileExistence" skipped. Previously built successfully.
         1>Target "BuildGenerateSourcesTraverse" in file "C:\Windows\Microsoft.NET\Framework\v4.0.30319\Microsoft.Common.Targets" from project "D:\hussein\KinectQtDataAcquisition\KinectQtDataAcquisition\QtDataAcquisition.vcxproj" (target "BuildGenerateSources" depends on it):
           Task "MSBuild" skipped, due to false condition; ('$(BuildPassReferences)' == 'true' and '@(ProjectReferenceWithConfiguration)' != '' and '@(_MSBuildProjectReferenceExistent)' != '' and '%(_MSBuildProjectReferenceExistent.BuildReference)' == 'true') was evaluated as ('' == 'true' and '' != '' and '' != '' and '' == 'true').
         1>Done building target "BuildGenerateSourcesTraverse" in project "QtDataAcquisition.vcxproj".
           Target "SetBuildDefaultEnvironmentVariables" skipped. Previously built successfully.
           Target "SetUserMacroEnvironmentVariables" skipped, due to false condition; ('@(BuildMacro)' != '') was evaluated as ('' != '').
           Target "PrepareForBuild" skipped. Previously built successfully.
           Target "ResolveReferences" skipped. Previously built successfully.
         1>Target "BeforeBuildGenerateSources" in file "C:\Program Files\MSBuild\Microsoft.Cpp\v4.0\Microsoft.BuildSteps.Targets" from project "D:\hussein\KinectQtDataAcquisition\KinectQtDataAcquisition\QtDataAcquisition.vcxproj" (target "BuildGenerateSources" depends on it):
         1>Done building target "BeforeBuildGenerateSources" in project "QtDataAcquisition.vcxproj".
         1>Target "PreBuildEvent" in file "C:\Program Files\MSBuild\Microsoft.Cpp\v4.0\Microsoft.CppCommon.targets" from project "D:\hussein\KinectQtDataAcquisition\KinectQtDataAcquisition\QtDataAcquisition.vcxproj" (target "BuildGenerateSources" depends on it):
           Task "Message" skipped, due to false condition; ('%(PreBuildEvent.Message)' != '' and '%(PreBuildEvent.Command)' != '') was evaluated as ('' != '' and '' != '').
           Task "Exec" skipped, due to false condition; ('%(PreBuildEvent.Command)' != '') was evaluated as ('' != '').
         1>Done building target "PreBuildEvent" in project "QtDataAcquisition.vcxproj".
           Target "PrepareForBuild" skipped. Previously built successfully.
           Target "SetBuildDefaultEnvironmentVariables" skipped. Previously built successfully.
           Target "SetUserMacroEnvironmentVariables" skipped, due to false condition; ('@(BuildMacro)' != '') was evaluated as ('' != '').
         1>Target "_SelectedFiles" in file "C:\Program Files\MSBuild\Microsoft.Cpp\v4.0\Microsoft.CppBuild.targets" from project "D:\hussein\KinectQtDataAcquisition\KinectQtDataAcquisition\QtDataAcquisition.vcxproj" (target "SelectCustomBuild" depends on it):
         1>Done building target "_SelectedFiles" in project "QtDataAcquisition.vcxproj".
         1>Target "SelectCustomBuild" in file "C:\Program Files\MSBuild\Microsoft.Cpp\v4.0\Microsoft.CppBuild.targets" from project "D:\hussein\KinectQtDataAcquisition\KinectQtDataAcquisition\QtDataAcquisition.vcxproj" (target "CustomBuild" depends on it):
         1>Done building target "SelectCustomBuild" in project "QtDataAcquisition.vcxproj".
         1>Target "ComputeCustomBuildOutput" in file "C:\Program Files\MSBuild\Microsoft.Cpp\v4.0\Microsoft.CppBuild.targets" from project "D:\hussein\KinectQtDataAcquisition\KinectQtDataAcquisition\QtDataAcquisition.vcxproj" (target "CustomBuild" depends on it):
           Task "MakeDir"
           Done executing task "MakeDir".
         1>Done building target "ComputeCustomBuildOutput" in project "QtDataAcquisition.vcxproj".
         1>Target "CustomBuild" in file "C:\Program Files\MSBuild\Microsoft.Cpp\v4.0\Microsoft.CppCommon.targets" from project "D:\hussein\KinectQtDataAcquisition\KinectQtDataAcquisition\QtDataAcquisition.vcxproj" (target "BuildGenerateSources" depends on it):
           Using "CustomBuild" task from assembly "Microsoft.Build.CppTasks.Common, Version=4.0.0.0, Culture=neutral, PublicKeyToken=b03f5f7f11d50a3a".
           Task "CustomBuild"
             Write Tracking Logs:
             	Debug\custombuild.write.1.tlog
             Read Tracking Logs:
             	Debug\custombuild.read.1.tlog
             No output for D:\HUSSEIN\KINECTQTDATAACQUISITION\KINECTQTDATAACQUISITION\DATACOLLECTOR.H|D:\HUSSEIN\KINECTQTDATAACQUISITION\KINECTQTDATAACQUISITION\QTDATAACQUISITION.H|D:\HUSSEIN\KINECTQTDATAACQUISITION\KINECTQTDATAACQUISITION\QTDATAACQUISITION.QRC|D:\HUSSEIN\KINECTQTDATAACQUISITION\KINECTQTDATAACQUISITION\QTDATAACQUISITION.UI was found in the tracking log; source compilation required.
             DataCollector.h will be compiled as it was not found in the tracking log.
             qtdataacquisition.h will be compiled as it was not found in the tracking log.
             qtdataacquisition.qrc will be compiled as it was not found in the tracking log.
             qtdataacquisition.ui will be compiled as it was not found in the tracking log.
             "\bin\moc.exe"   -DUNICODE -DWIN32 -DQT_LARGEFILE_SUPPORT -DQT_CORE_LIB -DQT_GUI_LIB  "-I." "-I.\GeneratedFiles" "-I\include" "-I.\GeneratedFiles\Debug\." "-I\include\qtmain" "-I\include\QtCore" "-I\include\QtGui" "-I." "-I." "-I." "-I." "qtdataacquisition.h" -o ".\GeneratedFiles\Debug\moc_qtdataacquisition.cpp"
             "\bin\uic.exe" -o ".\GeneratedFiles\ui_qtdataacquisition.h" "D:\hussein\KinectQtDataAcquisition\KinectQtDataAcquisition\qtdataacquisition.ui"
             "\bin\moc.exe"  "D:\hussein\KinectQtDataAcquisition\KinectQtDataAcquisition\DataCollector.h" -o ".\GeneratedFiles\Debug\moc_DataCollector.cpp"  -DUNICODE -DWIN32 -DQT_LARGEFILE_SUPPORT -DQT_CORE_LIB -DQT_GUI_LIB "-I." "-I.\GeneratedFiles" "-I\include" "-I.\GeneratedFiles\Debug\." "-I\include\qtmain" "-I\include\QtCore" "-I\include\QtGui" "-I." "-I." "-I." "-I."
             "\bin\rcc.exe" -name "qtdataacquisition" -no-compress "D:\hussein\KinectQtDataAcquisition\KinectQtDataAcquisition\qtdataacquisition.qrc" -o .\GeneratedFiles\qrc_qtdataacquisition.cpp
             The system cannot find the path specified.
             Moc'ing qtdataacquisition.h...
             Uic'ing qtdataacquisition.ui...
             The system cannot find the path specified.
             Moc'ing DataCollector.h...
             The system cannot find the path specified.
             The system cannot find the path specified.
             Rcc'ing qtdataacquisition.qrc...
         1>C:\Program Files\MSBuild\Microsoft.Cpp\v4.0\Microsoft.CppCommon.targets(151,5): error MSB6006: "cmd.exe" exited with code 3.
           Done executing task "CustomBuild" -- FAILED.
         1>Done building target "CustomBuild" in project "QtDataAcquisition.vcxproj" -- FAILED.
         1>Done Building Project "D:\hussein\KinectQtDataAcquisition\KinectQtDataAcquisition\QtDataAcquisition.vcxproj" (build target(s)) -- FAILED.
    
    Build FAILED.
    
    Time Elapsed 00:00:00.15

    Tuesday, March 19, 2013 1:52 AM
  • Hi,

    From your error:

    The system cannot find the path specified.
             Moc'ing qtdataacquisition.h...
             Uic'ing qtdataacquisition.ui...
             The system cannot find the path specified.
             Moc'ing DataCollector.h...
             The system cannot find the path specified.
             The system cannot find the path specified.
             Rcc'ing qtdataacquisition.qrc...
         1>C:\Program Files\MSBuild\Microsoft.Cpp\v4.0\Microsoft.CppCommon.targets(151,5): error MSB6006: "cmd.exe" exited with code 3.

    I think it is an issue when you compiling a QT project. So please ask it to:

    http://qt-project.org/forums

    We are moving this thread to off-topic forum.

    Thank you for your understanding and support.

    Best regards,


    Ego [MSFT]
    MSDN Community Support | Feedback to us
    Develop and promote your apps in Windows Store
    Please remember to mark the replies as answers if they help and unmark them if they provide no help.

    Tuesday, March 26, 2013 2:38 AM