none
unresolved externals RRS feed

  • Question

  • getting the following error when i try to build this c++ console app:

    1>kat1.obj : error LNK2019: unresolved external symbol __imp__FTCreateFaceTracker@4 referenced in function _wmain
    1>kat1.obj : error LNK2019: unresolved external symbol __imp__FTCreateImage@0 referenced in function _wmain
    1>C:\Users\micha_000\documents\visual studio 2012\Projects\kat1\Debug\kat1.exe : fatal error LNK1120: 2 unresolved externals
    ========== Rebuild All: 0 succeeded, 1 failed, 0 skipped ==========

    under project propertys vc++ directories i have the include directories has:
    c:\program files\microsoft SDKs\Kinect\v1.6\inc
    c:\program files\microsoft SDKs\Developer Toolkit v1.6.0\inc

    under library directories i have
    c:\program files\microsoft SDKs\kinect\developer toolkit v1.6.0\lib\x86

    using visual studio 2012, anyone have i idea what i'm missing ??
    Wednesday, February 20, 2013 9:26 AM