none
Error MSB6006: "cmd.exe" exited with code 3.

    Question

  • Hey, 

    I have trouble compiling this program. Can someone help me out here?

    Here's the output:

    1>------ Build started: Project: fluids_v3, Configuration: Debug Win32 ------
    1>Build started 8/20/2013 12:25:26 PM.
    1>Environment at start of build:
    1>MSBuildExtensionsPath32 = C:\Program Files (x86)\MSBuild
    1>MSBuildExtensionsPath64 = C:\Program Files\MSBuild
    1>MSBuildExtensionsPath = C:\Program Files (x86)\MSBuild
    1>LOCALAPPDATA = C:\Users\Phillip\AppData\Local
    1>ALLUSERSPROFILE = C:\ProgramData
    1>ANSYS145_DIR = C:\Program Files\ANSYS Inc\v145\ANSYS
    1>ANSYSLIC_DIR = C:\Program Files\ANSYS Inc\Shared Files\Licensing
    1>ANSYS_SYSDIR = winx64
    1>ANSYS_SYSDIR32 = win32
    1>APPDATA = C:\Users\Phillip\AppData\Roaming
    1>AWP_LOCALE145 = en-us
    1>AWP_ROOT145 = C:\Program Files\ANSYS Inc\v145
    1>CADOE_DOCDIR145 = C:\Program Files\ANSYS Inc\v145\CommonFiles\help\en-us\solviewer
    1>CADOE_LIBDIR145 = C:\Program Files\ANSYS Inc\v145\CommonFiles\Language\en-us
    1>CG_BIN64_PATH = C:\Program Files (x86)\NVIDIA Corporation\Cg\bin.x64
    1>CG_BIN_PATH = C:\Program Files (x86)\NVIDIA Corporation\Cg\bin
    1>CG_INC_PATH = C:\Program Files (x86)\NVIDIA Corporation\Cg\include
    1>CG_LIB64_PATH = C:\Program Files (x86)\NVIDIA Corporation\Cg\lib.x64
    1>CG_LIB_PATH = C:\Program Files (x86)\NVIDIA Corporation\Cg\lib
    1>CommonProgramFiles = C:\Program Files (x86)\Common Files
    1>CommonProgramW6432 = C:\Program Files\Common Files
    1>COMPUTERNAME = PHILLIP-PC
    1>ComSpec = C:\Windows\system32\cmd.exe
    1>CUDA_BIN_PATH = C:\Program Files\NVIDIA GPU Computing Toolkit\CUDA\v5.5bin
    1>CUDA_INC_PATH = C:\Program Files\NVIDIA GPU Computing Toolkit\CUDA\v5.5include
    1>CUDA_LIB_PATH = C:\Program Files\NVIDIA GPU Computing Toolkit\CUDA\v5.5lib\x64
    1>CUDA_PATH = C:\Program Files\NVIDIA GPU Computing Toolkit\CUDA\v5.5
    1>CUDA_PATH_V4_2 = C:\Program Files\NVIDIA GPU Computing Toolkit\CUDA\v4.2\
    1>CUDA_PATH_V5_5 = C:\Program Files\NVIDIA GPU Computing Toolkit\CUDA\v5.5
    1>FP_NO_HOST_CHECK = NO
    1>HOMEDRIVE = C:
    1>HOMEPATH = \Users\Phillip
    1>ICEMCFD_ROOT145 = C:\Program Files\ANSYS Inc\v145\icemcfd
    1>ICEMCFD_SYSDIR = win64_amd
    1>LOGONSERVER = \\PHILLIP-PC
    1>LSTC_LICENSE = ANSYS
    1>NUMBER_OF_PROCESSORS = 8
    1>NVCUDASAMPLES5_5_ROOT = C:\ProgramData\NVIDIA Corporation\CUDA Samples\v5.5
    1>NVCUDASAMPLES_ROOT = C:\ProgramData\NVIDIA Corporation\CUDA Samples\v5.5
    1>NVSDKCOMPUTE_ROOT = C:\ProgramData\NVIDIA Corporation\NVIDIA GPU Computing SDK 4.2
    1>NVTOOLSEXT_PATH = C:\Program Files\NVIDIA Corporation\NvToolsExt\
    1>OS = Windows_NT
    1>Path = C:\Program Files\NVIDIA GPU Computing Toolkit\CUDA\v5.5\bin;C:\Program Files\NVIDIA GPU Computing Toolkit\CUDA\v5.5\libnvvp;C:\Program Files (x86)\Microsoft SDKs\Windows\v7.0A\Bin;.;;.;
    1>PATHEXT = .COM;.EXE;.BAT;.CMD;.VBS;.VBE;.JS;.JSE;.WSF;.WSH;.MSC
    1>PROCESSOR_ARCHITECTURE = x86
    1>PROCESSOR_ARCHITEW6432 = AMD64
    1>PROCESSOR_IDENTIFIER = Intel64 Family 6 Model 58 Stepping 9, GenuineIntel
    1>PROCESSOR_LEVEL = 6
    1>PROCESSOR_REVISION = 3a09
    1>ProgramData = C:\ProgramData
    1>ProgramFiles = C:\Program Files (x86)
    1>ProgramW6432 = C:\Program Files
    1>PSModulePath = C:\Windows\system32\WindowsPowerShell\v1.0\Modules\
    1>PUBLIC = C:\Users\Public
    1>P_SCHEMA = C:\Program Files\ANSYS Inc\v145\AISOL\CADIntegration\Parasolid\PSchema
    1>SESSIONNAME = Console
    1>SystemDrive = C:
    1>SystemRoot = C:\Windows
    1>TEMP = C:\Temp
    1>TMP = C:\Temp
    1>USERDOMAIN = Phillip-PC
    1>USERNAME = Phillip
    1>USERPROFILE = C:\Users\Phillip
    1>VisualStudioDir = C:\Users\Phillip\Documents\Visual Studio 2010
    1>VS100COMNTOOLS = D:\Program Files (x86)\Microsoft Visual Studio 10.0\Common7\Tools\
    1>windir = C:\Windows
    1>__COMPAT_LAYER = ElevateCreateProcess
    1>
    1>Building with tools version "4.0".
    1>Target "_CheckForInvalidConfigurationAndPlatform: (TargetId:2)" in file "C:\Windows\Microsoft.NET\Framework\v4.0.30319\Microsoft.Common.Targets" from project "C:\Users\Phillip\Desktop\fluids_v3_src\fluids_v3.vcxproj" (entry point):
    1>Task "Error" skipped, due to false condition; ( '$(_InvalidConfigurationError)' == 'true' ) was evaluated as ( '' == 'true' ).
    1>Task "Warning" skipped, due to false condition; ( '$(_InvalidConfigurationWarning)' == 'true' ) was evaluated as ( '' == 'true' ).
    1>Using "Message" task from assembly "Microsoft.Build.Tasks.v4.0, Version=4.0.0.0, Culture=neutral, PublicKeyToken=b03f5f7f11d50a3a".
    1>Task "Message" (TaskId:2)
    1>  Configuration=Debug (TaskId:2)
    1>Done executing task "Message". (TaskId:2)
    1>Task "Message" (TaskId:3)
    1>  Platform=Win32 (TaskId:3)
    1>Done executing task "Message". (TaskId:3)
    1>Task "Error" skipped, due to false condition; ('$(OutDir)' != '' and !HasTrailingSlash('$(OutDir)')) was evaluated as ('C:\Users\Phillip\Desktop\fluids_v3_src\Debug\' != '' and !HasTrailingSlash('C:\Users\Phillip\Desktop\fluids_v3_src\Debug\')).
    1>Task "Error" skipped, due to false condition; ('$(BaseIntermediateOutputPath)' != '' and !HasTrailingSlash('$(BaseIntermediateOutputPath)')) was evaluated as ('obj\' != '' and !HasTrailingSlash('obj\')).
    1>Task "Error" skipped, due to false condition; ('$(IntermediateOutputPath)' != '' and !HasTrailingSlash('$(IntermediateOutputPath)')) was evaluated as ('Debug\' != '' and !HasTrailingSlash('Debug\')).
    1>Done building target "_CheckForInvalidConfigurationAndPlatform" in project "fluids_v3.vcxproj".: (TargetId:2)
    1>Target "_DetermineManagedStateFromCL: (TargetId:3)" in file "C:\Program Files (x86)\MSBuild\Microsoft.Cpp\v4.0\Microsoft.CppBuild.targets" from project "C:\Users\Phillip\Desktop\fluids_v3_src\fluids_v3.vcxproj" (target "Build" depends on it):
    1>Done building target "_DetermineManagedStateFromCL" in project "fluids_v3.vcxproj".: (TargetId:3)
    1>Target "_PrepareForBuild: (TargetId:4)" in file "C:\Program Files (x86)\MSBuild\Microsoft.Cpp\v4.0\Microsoft.BuildSteps.Targets" from project "C:\Users\Phillip\Desktop\fluids_v3_src\fluids_v3.vcxproj" (target "Build" depends on it):
    1>Done building target "_PrepareForBuild" in project "fluids_v3.vcxproj".: (TargetId:4)
    1>Target "SetBuildDefaultEnvironmentVariables: (TargetId:5)" in file "C:\Program Files (x86)\MSBuild\Microsoft.Cpp\v4.0\Microsoft.Cpp.targets" from project "C:\Users\Phillip\Desktop\fluids_v3_src\fluids_v3.vcxproj" (target "Build" depends on it):
    1>Using "SetEnv" task from assembly "Microsoft.Build.CppTasks.Common, Version=4.0.0.0, Culture=neutral, PublicKeyToken=b03f5f7f11d50a3a".
    1>Task "SetEnv" (TaskId:4)
    1>  PATH=libs;D:\Program Files (x86)\Microsoft Visual Studio 10.0\VC\bin;C:\Program Files (x86)\Microsoft SDKs\Windows\v7.0A\bin\NETFX 4.0 Tools;C:\Program Files (x86)\Microsoft SDKs\Windows\v7.0A\bin;D:\Program Files (x86)\Microsoft Visual Studio 10.0\Common7\Tools\bin;D:\Program Files (x86)\Microsoft Visual Studio 10.0\Common7\tools;D:\Program Files (x86)\Microsoft Visual Studio 10.0\Common7\ide;C:\Program Files (x86)\HTML Help Workshop;C:\Program Files (x86)\Microsoft SDKs\Windows\v7.0A\\bin;C:\Windows\Microsoft.NET\Framework\v4.0.30319\;D:\Program Files (x86)\Microsoft Visual Studio 10.0\;C:\Windows\SysWow64;;C:\Program Files\NVIDIA GPU Computing Toolkit\CUDA\v5.5\bin;C:\Program Files\NVIDIA GPU Computing Toolkit\CUDA\v5.5\libnvvp;C:\Program Files (x86)\Microsoft SDKs\Windows\v7.0A\Bin;.;;.;; (TaskId:4)
    1>Done executing task "SetEnv". (TaskId:4)
    1>Task "SetEnv" skipped, due to false condition; ('$(_IsNativeEnvironment)' == 'true') was evaluated as ('' == 'true').
    1>Task "SetEnv" (TaskId:5)
    1>  LIB=libs;C:\Program Files\NVIDIA GPU Computing Toolkit\CUDA\v4.2\lib\Win32;D:\Program Files (x86)\Microsoft Visual Studio 10.0\VC\lib;D:\Program Files (x86)\Microsoft Visual Studio 10.0\VC\atlmfc\lib;C:\Program Files (x86)\Microsoft SDKs\Windows\v7.0A\lib;C:\Program Files (x86)\Microsoft SDKs\Windows\v7.0A\\lib (TaskId:5)
    1>Done executing task "SetEnv". (TaskId:5)
    1>Task "SetEnv" (TaskId:6)
    1>  LIBPATH=libs;D:\Program Files (x86)\Microsoft Visual Studio 10.0\VC\atlmfc\lib;D:\Program Files (x86)\Microsoft Visual Studio 10.0\VC\lib (TaskId:6)
    1>Done executing task "SetEnv". (TaskId:6)
    1>Task "SetEnv" (TaskId:7)
    1>  INCLUDE=libs;C:\Program Files\NVIDIA GPU Computing Toolkit\CUDA\v4.2\include;D:\Program Files (x86)\Microsoft Visual Studio 10.0\VC\include;D:\Program Files (x86)\Microsoft Visual Studio 10.0\VC\atlmfc\include;C:\Program Files (x86)\Microsoft SDKs\Windows\v7.0A\include;C:\Program Files (x86)\Microsoft SDKs\Windows\v7.0A\\include; (TaskId:7)
    1>Done executing task "SetEnv". (TaskId:7)
    1>Done building target "SetBuildDefaultEnvironmentVariables" in project "fluids_v3.vcxproj".: (TargetId:5)
    1>Target "SetUserMacroEnvironmentVariables" skipped, due to false condition; ('@(BuildMacro)' != '') was evaluated as ('' != '').
    1>Target "BeforeResolveReferences: (TargetId:6)" in file "C:\Windows\Microsoft.NET\Framework\v4.0.30319\Microsoft.Common.Targets" from project "C:\Users\Phillip\Desktop\fluids_v3_src\fluids_v3.vcxproj" (target "ResolveReferences" depends on it):
    1>Done building target "BeforeResolveReferences" in project "fluids_v3.vcxproj".: (TargetId:6)
    1>Target "AssignProjectConfiguration" skipped, due to false condition; ('@(ProjectReference)'!='') was evaluated as (''!='').
    1>Target "AssignProjectConfiguration" skipped, due to false condition; ('@(ProjectReference)'!='') was evaluated as (''!='').
    1>Target "_SplitProjectReferencesByFileExistence: (TargetId:7)" in file "C:\Windows\Microsoft.NET\Framework\v4.0.30319\Microsoft.Common.Targets" from project "C:\Users\Phillip\Desktop\fluids_v3_src\fluids_v3.vcxproj" (target "ResolveProjectReferences" depends on it):
    1>Task "ResolveNonMSBuildProjectOutput" skipped, due to false condition; ('$(BuildingInsideVisualStudio)'=='true' and '@(ProjectReferenceWithConfiguration)'!='') was evaluated as ('true'=='true' and ''!='').
    1>Done building target "_SplitProjectReferencesByFileExistence" in project "fluids_v3.vcxproj".: (TargetId:7)
    1>Target "_RemoveNameMetadataFromProjectReferenceItems" skipped, due to false condition; ('@(ProjectReference)'!='') was evaluated as (''!='').
    1>Target "ResolveProjectReferences: (TargetId:8)" in file "C:\Windows\Microsoft.NET\Framework\v4.0.30319\Microsoft.Common.Targets" from project "C:\Users\Phillip\Desktop\fluids_v3_src\fluids_v3.vcxproj" (target "ResolveReferences" depends on it):
    1>Task "MSBuild" skipped, due to false condition; ('%(_MSBuildProjectReferenceExistent.BuildReference)' == 'true' and '@(ProjectReferenceWithConfiguration)' != '' and ('$(BuildingInsideVisualStudio)' == 'true' or '$(BuildProjectReferences)' != 'true') and '@(_MSBuildProjectReferenceExistent)' != '') was evaluated as ('' == 'true' and '' != '' and ('true' == 'true' or 'true' != 'true') and '' != '').
    1>Task "MSBuild" skipped, due to false condition; ('%(_MSBuildProjectReferenceExistent.BuildReference)' == 'true' and '@(ProjectReferenceWithConfiguration)' != '' and '$(BuildingInsideVisualStudio)' != 'true' and '$(BuildProjectReferences)' == 'true' and '@(_MSBuildProjectReferenceExistent)' != '') was evaluated as ('' == 'true' and '' != '' and 'true' != 'true' and 'true' == 'true' and '' != '').
    1>Task "MSBuild" skipped, due to false condition; ('%(_MSBuildProjectReferenceExistent.BuildReference)' == 'true' and '@(ProjectReferenceWithConfiguration)' != '' and '$(BuildingProject)' == 'true' and '@(_MSBuildProjectReferenceExistent)' != '') was evaluated as ('' == 'true' and '' != '' and 'true' == 'true' and '' != '').
    1>Task "Warning" skipped, due to false condition; ('@(ProjectReferenceWithConfiguration)' != '' and '@(_MSBuildProjectReferenceNonexistent)' != '') was evaluated as ('' != '' and '' != '').
    1>Done building target "ResolveProjectReferences" in project "fluids_v3.vcxproj".: (TargetId:8)
    1>Target "ResolveNativeReferences" skipped, due to false condition; ('@(NativeReference)'!='') was evaluated as (''!='').
    1>Target "ResolveAssemblyReferences" skipped, due to false condition; ('@(Reference)'!='' or '@(_ResolvedProjectReferencePaths)'!='' or '@(_ExplicitReference)' != '') was evaluated as (''!='' or ''!='' or '' != '').
    1>Target "ResolveComReferences" skipped, due to false condition; ('@(COMReference)'!='' or '@(COMFileReference)'!='') was evaluated as (''!='' or ''!='').
    1>Target "AfterResolveReferences: (TargetId:9)" in file "C:\Windows\Microsoft.NET\Framework\v4.0.30319\Microsoft.Common.Targets" from project "C:\Users\Phillip\Desktop\fluids_v3_src\fluids_v3.vcxproj" (target "ResolveReferences" depends on it):
    1>Done building target "AfterResolveReferences" in project "fluids_v3.vcxproj".: (TargetId:9)
    1>Target "ResolveTestReferences" skipped, due to false condition; ('@(Shadow)'!='') was evaluated as (''!='').
    1>Target "ResolveReferences: (TargetId:10)" in file "C:\Windows\Microsoft.NET\Framework\v4.0.30319\Microsoft.Common.Targets" from project "C:\Users\Phillip\Desktop\fluids_v3_src\fluids_v3.vcxproj" (target "Build" depends on it):
    1>Done building target "ResolveReferences" in project "fluids_v3.vcxproj".: (TargetId:10)
    1>Target "PlatformPrepareForBuild: (TargetId:11)" in file "C:\Program Files (x86)\MSBuild\Microsoft.Cpp\v4.0\Platforms\Win32\Microsoft.Cpp.Win32.Targets" from project "C:\Users\Phillip\Desktop\fluids_v3_src\fluids_v3.vcxproj" (target "PrepareForBuild" depends on it):
    1>Task "VCMessage" skipped, due to false condition; (!(exists('$(VCTargetsPath)\Platforms\Win32\PlatformToolsets\$(PlatformToolset)\Microsoft.Cpp.Win32.$(PlatformToolset).targets'))) was evaluated as (!(exists('C:\Program Files (x86)\MSBuild\Microsoft.Cpp\v4.0\\Platforms\Win32\PlatformToolsets\v100\Microsoft.Cpp.Win32.v100.targets'))).
    1>Done building target "PlatformPrepareForBuild" in project "fluids_v3.vcxproj".: (TargetId:11)
    1>Target "GetFrameworkPaths: (TargetId:12)" in file "C:\Windows\Microsoft.NET\Framework\v4.0.30319\Microsoft.NETFramework.targets" from project "C:\Users\Phillip\Desktop\fluids_v3_src\fluids_v3.vcxproj" (target "PrepareForBuild" depends on it):
    1>Done building target "GetFrameworkPaths" in project "fluids_v3.vcxproj".: (TargetId:12)
    1>Target "GetWinFXPath" skipped, due to false condition; (('@(Page)' != '' or '@(ApplicationDefinition)' != '' or '@(Resource)' != '') and ('$(GetWinFXNativePath)' != '' or '$(GetWinFXWoWPath)' != '' )) was evaluated as (('' != '' or '' != '' or '' != '') and ('' != '' or '' != '' )).
    1>Target "GetReferenceAssemblyPaths: (TargetId:13)" in file "C:\Windows\Microsoft.NET\Framework\v4.0.30319\Microsoft.Common.Targets" from project "C:\Users\Phillip\Desktop\fluids_v3_src\fluids_v3.vcxproj" (target "PrepareForBuild" depends on it):
    1>Task "GetReferenceAssemblyPaths" skipped, due to false condition; ('$(TargetFrameworkMoniker)' != '' and ('$(_TargetFrameworkDirectories)' == '' or '$(_FullFrameworkReferenceAssemblyPaths)' == '')) was evaluated as ('.NETFramework,Version=v4.0' != '' and ('C:\Program Files (x86)\Reference Assemblies\Microsoft\Framework\.NETFramework\v4.0' == '' or 'C:\Program Files (x86)\Reference Assemblies\Microsoft\Framework\.NETFramework\v4.0' == '')).
    1>Done building target "GetReferenceAssemblyPaths" in project "fluids_v3.vcxproj".: (TargetId:13)
    1>Target "PrepareForBuild: (TargetId:14)" in file "C:\Program Files (x86)\MSBuild\Microsoft.Cpp\v4.0\Microsoft.CppBuild.targets" from project "C:\Users\Phillip\Desktop\fluids_v3_src\fluids_v3.vcxproj" (target "Build" depends on it):
    1>Task "VCMessage" skipped, due to false condition; ('$(DesignTimeBuild)'!='true' and '$(ConfigurationPlatformExists)' != 'true') was evaluated as (''!='true' and 'true' != 'true').
    1>Using "MakeDir" task from assembly "Microsoft.Build.Tasks.v4.0, Version=4.0.0.0, Culture=neutral, PublicKeyToken=b03f5f7f11d50a3a".
    1>Task "MakeDir" (TaskId:8)
    1>Done executing task "MakeDir". (TaskId:8)
    1>Task "VCMessage" skipped, due to false condition; ('$(DesignTimeBuild)'!='true' and '$(VCInstallDir)'=='' and '$(UseEnv)' != 'true' and ($(TargetFrameworkVersion)=='v3.5' or $(TargetFrameworkVersion)=='v3.0' or $(TargetFrameworkVersion)=='v2.0' )) was evaluated as (''!='true' and 'D:\Program Files (x86)\Microsoft Visual Studio 10.0\VC\'=='' and '' != 'true' and (v4.0=='v3.5' or v4.0=='v3.0' or v4.0=='v2.0' )).
    1>Task "VCMessage" skipped, due to false condition; ('$(DesignTimeBuild)'!='true' and '$(VCInstallDir)'=='' and '$(UseEnv)' != 'true' and '$(PlatformToolset)'=='v90') was evaluated as (''!='true' and 'D:\Program Files (x86)\Microsoft Visual Studio 10.0\VC\'=='' and '' != 'true' and 'v100'=='v90').
    1>Task "VCMessage" skipped, due to false condition; ('$(VCInstallDir)'=='' and '$(UseEnv)' != 'true') was evaluated as ('D:\Program Files (x86)\Microsoft Visual Studio 10.0\VC\'=='' and '' != 'true').
    1>Task "VCMessage" skipped, due to false condition; ('$(WindowsSDKDir)'=='' and '$(UseEnv)' != 'true') was evaluated as ('C:\Program Files (x86)\Microsoft SDKs\Windows\v7.0A\'=='' and '' != 'true').
    1>Task "VCMessage" skipped, due to false condition; ('$(IntDirTrailingSlashWarning)'=='true') was evaluated as (''=='true').
    1>Task "VCMessage" skipped, due to false condition; ('$(OutDirTrailingSlashWarning)'=='true') was evaluated as (''=='true').
    1>Task "MakeDir" (TaskId:9)
    1>Done executing task "MakeDir". (TaskId:9)
    1>Done building target "PrepareForBuild" in project "fluids_v3.vcxproj".: (TargetId:14)
    1>Target "PrepareForBuild" skipped. Previously built successfully.
    1>Target "InitializeBuildStatus: (TargetId:15)" in file "C:\Program Files (x86)\MSBuild\Microsoft.Cpp\v4.0\Microsoft.CppBuild.targets" from project "C:\Users\Phillip\Desktop\fluids_v3_src\fluids_v3.vcxproj" (target "Build" depends on it):
    1>Using "ReadLinesFromFile" task from assembly "Microsoft.Build.Tasks.v4.0, Version=4.0.0.0, Culture=neutral, PublicKeyToken=b03f5f7f11d50a3a".
    1>Task "ReadLinesFromFile" (TaskId:10)
    1>Done executing task "ReadLinesFromFile". (TaskId:10)
    1>Using "WriteLinesToFile" task from assembly "Microsoft.Build.Tasks.v4.0, Version=4.0.0.0, Culture=neutral, PublicKeyToken=b03f5f7f11d50a3a".
    1>Task "WriteLinesToFile" (TaskId:11)
    1>Done executing task "WriteLinesToFile". (TaskId:11)
    1>Using "Touch" task from assembly "Microsoft.Build.Tasks.v4.0, Version=4.0.0.0, Culture=neutral, PublicKeyToken=b03f5f7f11d50a3a".
    1>Task "Touch" (TaskId:12)
    1>  Touching "Debug\fluids_v3.unsuccessfulbuild". (TaskId:12)
    1>Done executing task "Touch". (TaskId:12)
    1>Done building target "InitializeBuildStatus" in project "fluids_v3.vcxproj".: (TargetId:15)
    1>Target "AssignProjectConfiguration" skipped, due to false condition; ('@(ProjectReference)'!='') was evaluated as (''!='').
    1>Target "_SplitProjectReferencesByFileExistence" skipped. Previously built successfully.
    1>Target "BuildGenerateSourcesTraverse: (TargetId:16)" in file "C:\Windows\Microsoft.NET\Framework\v4.0.30319\Microsoft.Common.Targets" from project "C:\Users\Phillip\Desktop\fluids_v3_src\fluids_v3.vcxproj" (target "BuildGenerateSources" depends on it):
    1>Task "MSBuild" skipped, due to false condition; ('$(BuildPassReferences)' == 'true' and '@(ProjectReferenceWithConfiguration)' != '' and '@(_MSBuildProjectReferenceExistent)' != '' and '%(_MSBuildProjectReferenceExistent.BuildReference)' == 'true') was evaluated as ('' == 'true' and '' != '' and '' != '' and '' == 'true').
    1>Done building target "BuildGenerateSourcesTraverse" in project "fluids_v3.vcxproj".: (TargetId:16)
    1>Target "SetBuildDefaultEnvironmentVariables" skipped. Previously built successfully.
    1>Target "SetUserMacroEnvironmentVariables" skipped, due to false condition; ('@(BuildMacro)' != '') was evaluated as ('' != '').
    1>Target "PrepareForBuild" skipped. Previously built successfully.
    1>Target "ResolveReferences" skipped. Previously built successfully.
    1>Target "BeforeBuildGenerateSources: (TargetId:17)" in file "C:\Program Files (x86)\MSBuild\Microsoft.Cpp\v4.0\Microsoft.BuildSteps.Targets" from project "C:\Users\Phillip\Desktop\fluids_v3_src\fluids_v3.vcxproj" (target "BuildGenerateSources" depends on it):
    1>Done building target "BeforeBuildGenerateSources" in project "fluids_v3.vcxproj".: (TargetId:17)
    1>Target "PreBuildEvent: (TargetId:18)" in file "C:\Program Files (x86)\MSBuild\Microsoft.Cpp\v4.0\Microsoft.CppCommon.targets" from project "C:\Users\Phillip\Desktop\fluids_v3_src\fluids_v3.vcxproj" (target "BuildGenerateSources" depends on it):
    1>Task "Message" skipped, due to false condition; ('%(PreBuildEvent.Message)' != '' and '%(PreBuildEvent.Command)' != '') was evaluated as ('' != '' and '' != '').
    1>Task "Exec" skipped, due to false condition; ('%(PreBuildEvent.Command)' != '') was evaluated as ('' != '').
    1>Done building target "PreBuildEvent" in project "fluids_v3.vcxproj".: (TargetId:18)
    1>Target "PrepareForBuild" skipped. Previously built successfully.
    1>Target "SetBuildDefaultEnvironmentVariables" skipped. Previously built successfully.
    1>Target "SetUserMacroEnvironmentVariables" skipped, due to false condition; ('@(BuildMacro)' != '') was evaluated as ('' != '').
    1>Target "_SelectedFiles: (TargetId:19)" in file "C:\Program Files (x86)\MSBuild\Microsoft.Cpp\v4.0\Microsoft.CppBuild.targets" from project "C:\Users\Phillip\Desktop\fluids_v3_src\fluids_v3.vcxproj" (target "SelectCustomBuild" depends on it):
    1>Done building target "_SelectedFiles" in project "fluids_v3.vcxproj".: (TargetId:19)
    1>Target "SelectCustomBuild: (TargetId:20)" in file "C:\Program Files (x86)\MSBuild\Microsoft.Cpp\v4.0\Microsoft.CppBuild.targets" from project "C:\Users\Phillip\Desktop\fluids_v3_src\fluids_v3.vcxproj" (target "CustomBuild" depends on it):
    1>Done building target "SelectCustomBuild" in project "fluids_v3.vcxproj".: (TargetId:20)
    1>Target "ComputeCustomBuildOutput: (TargetId:21)" in file "C:\Program Files (x86)\MSBuild\Microsoft.Cpp\v4.0\Microsoft.CppBuild.targets" from project "C:\Users\Phillip\Desktop\fluids_v3_src\fluids_v3.vcxproj" (target "CustomBuild" depends on it):
    1>Task "MakeDir" (TaskId:13)
    1>Done executing task "MakeDir". (TaskId:13)
    1>Done building target "ComputeCustomBuildOutput" in project "fluids_v3.vcxproj".: (TargetId:21)
    1>Target "CustomBuild: (TargetId:22)" in file "C:\Program Files (x86)\MSBuild\Microsoft.Cpp\v4.0\Microsoft.CppCommon.targets" from project "C:\Users\Phillip\Desktop\fluids_v3_src\fluids_v3.vcxproj" (target "BuildGenerateSources" depends on it):
    1>Using "CustomBuild" task from assembly "Microsoft.Build.CppTasks.Common, Version=4.0.0.0, Culture=neutral, PublicKeyToken=b03f5f7f11d50a3a".
    1>Task "CustomBuild" (TaskId:14)
    1>  Write Tracking Logs: (TaskId:14)
    1>   Debug\custombuild.write.1.tlog (TaskId:14)
    1>  Read Tracking Logs: (TaskId:14)
    1>   Debug\custombuild.read.1.tlog (TaskId:14)
    1>  No output for C:\USERS\PHILLIP\DESKTOP\FLUIDS_V3_SRC\FLUIDS\FLUID_SYSTEM_HOST.CU|C:\USERS\PHILLIP\DESKTOP\FLUIDS_V3_SRC\FLUIDS\FLUID_SYSTEM_KERN.CU was found in the tracking log; source compilation required. (TaskId:14)
    1>  fluids\fluid_system_host.cu will be compiled as it was not found in the tracking log. (TaskId:14)
    1>  fluids\fluid_system_kern.cu will be compiled as it was not found in the tracking log. (TaskId:14)
    1>  "C:\Program Files\NVIDIA GPU Computing Toolkit\CUDA\v5.5bin\nvcc.exe" -lcuda -lcublas -lcudart -m 32 -arch=sm_20 -ccbin "D:\Program Files (x86)\Microsoft Visual Studio 10.0\VC\\bin" -c -D_DEBUG -DWIN32 -D_CONSOLE -D_MBCS -Xcompiler /EHsc,/W3,/nologo,/Od,/Zi,/RTC1,/MTd -I "C:\Program Files\NVIDIA GPU Computing Toolkit\CUDA\v5.5include"; -I./  -I../../common/inc -o Debug\fluid_system_host.obj fluids\fluid_system_host.cu (TaskId:14)
    1>  "C:\Program Files\NVIDIA GPU Computing Toolkit\CUDA\v5.5bin\nvcc.exe" -lcuda -lcublas -lcudart -m 32 -arch=sm_20 -ccbin "D:\Program Files (x86)\Microsoft Visual Studio 10.0\VC\\bin" -c -D_DEBUG -DWIN32 -D_CONSOLE -D_MBCS -Xcompiler /EHsc,/W3,/nologo,/Od,/Zi,/RTC1,/MTd -I "C:\Program Files\NVIDIA GPU Computing Toolkit\CUDA\v5.5include"; -I./  -I../../common/inc -o Debug\fluid_system_kern.obj fluids\fluid_system_kern.cu (TaskId:14)
    1>  Performing Custom Build Tools (TaskId:14)
    1>  The system cannot find the path specified. (TaskId:14)
    1>  Performing Custom Build Tools (TaskId:14)
    1>  The system cannot find the path specified. (TaskId:14)
    1>C:\Program Files (x86)\MSBuild\Microsoft.Cpp\v4.0\Microsoft.CppCommon.targets(151,5): error MSB6006: "cmd.exe" exited with code 3.
    1>Done executing task "CustomBuild" -- FAILED. (TaskId:14)
    1>Done building target "CustomBuild" in project "fluids_v3.vcxproj" -- FAILED.: (TargetId:22)
    1>
    1>Project Performance Summary:
    1>       78 ms  C:\Users\Phillip\Desktop\fluids_v3_src\fluids_v3.vcxproj   1 calls
    1>                 78 ms  build                                      1 calls
    1>
    1>Target Performance Summary:
    1>        0 ms  _SplitProjectReferencesByFileExistence     1 calls
    1>        0 ms  GetFrameworkPaths                          1 calls
    1>        0 ms  ResolveReferences                          1 calls
    1>        0 ms  BeforeResolveReferences                    1 calls
    1>        0 ms  GetReferenceAssemblyPaths                  1 calls
    1>        0 ms  PlatformPrepareForBuild                    1 calls
    1>        0 ms  PrepareForBuild                            1 calls
    1>        0 ms  _PrepareForBuild                           1 calls
    1>        0 ms  ComputeCustomBuildOutput                   1 calls
    1>        0 ms  _DetermineManagedStateFromCL               1 calls
    1>        0 ms  ResolveProjectReferences                   1 calls
    1>        0 ms  BeforeBuildGenerateSources                 1 calls
    1>        0 ms  InitializeBuildStatus                      1 calls
    1>        0 ms  SetBuildDefaultEnvironmentVariables        1 calls
    1>        0 ms  AfterResolveReferences                     1 calls
    1>        0 ms  SelectCustomBuild                          1 calls
    1>        0 ms  _SelectedFiles                             1 calls
    1>        0 ms  PreBuildEvent                              1 calls
    1>       16 ms  BuildGenerateSourcesTraverse               1 calls
    1>       16 ms  _CheckForInvalidConfigurationAndPlatform   1 calls
    1>       47 ms  CustomBuild                                1 calls
    1>
    1>Task Performance Summary:
    1>        0 ms  WriteLinesToFile                           1 calls
    1>        0 ms  MakeDir                                    3 calls
    1>        0 ms  ReadLinesFromFile                          1 calls
    1>        0 ms  Touch                                      1 calls
    1>        0 ms  SetEnv                                     4 calls
    1>       16 ms  Message                                    2 calls
    1>       47 ms  CustomBuild                                1 calls
    1>
    1>Build FAILED.
    1>
    1>Time Elapsed 00:00:00.09
    ========== Build: 0 succeeded, 1 failed, 0 up-to-date, 0 skipped ==========

    Tuesday, August 20, 2013 2:32 AM

Answers

  • Hi,

    According to your log content, I notice that it couldn’t find the path for some files in your project so that the build action is failed. Please refer to these items below:

    1> Performing Custom Build Tools (TaskId:14)
    1> The system cannot find the path specified. (TaskId:14)
    1> Performing Custom Build Tools (TaskId:14)
    1> The system cannot find the path specified. (TaskId:14)

    1>C:\Program Files (x86)\MSBuild\Microsoft.Cpp\v4.0\Microsoft.CppCommon.targets(151,5): error MSB6006: "cmd.exe" exited with code 3.

    In my opinion, it will be related to your specific project, for example, I find that one similar issue here as yours which has been asked in the specify QT project forum. So if possible, you could pose this issue to the specific project development forum for better response.

    If there's any concern, please feel free to let me know.


    Sophia Gou <THE CONTENT IS PROVIDED "AS IS" WITHOUT WARRANTY OF ANY KIND, WHETHER EXPRESS OR IMPLIED> MSDN Community Support Please remember to "Mark as Answer" the responses that resolved your issue.

    Wednesday, August 21, 2013 8:58 AM